Original Effective Date,Plan Type,Control,Suffix,Account,Policy Number,ID,EE SSN,Dependent SSN,Dependent Relationship,Last Name,First Name,Middle Initial,DOB,Gender,Address,State,City,Country,Postcode,Max/Ded,Premium,
07/29/2018,Beacon International,863949,020,00072,ARS-01-0043123,201823119,,,,ilowitz,Chaya R,,11/20/2000,female,12 Engelberg Terr,New Jersey,Lakewood,United States,08701,$2000000/$0,$48,
07/29/2018,Beacon International,863949,020,00072,ARS-01-0043119,201823112,,,,Reason,Lucy-Mae,V,09/14/2001,female,10717 Verna Trl W,Texas,Fort Worth,United States,76108,$60000/$250,$11.2,
07/29/2018,Beacon International,863949,020,00072,ARS-01-0043118,201823114,,,,Reason,Emily,C,07/11/1996,female,10717 Verna Trl W,Texas,Fort Worth,United States,76108,$60000/$250,$12.16,
07/29/2018,Beacon International,863949,020,00072,ARS-01-0043117,201823109,,,,Reason,Rachel,A,04/17/1972,female,10717 Verna Trl W,Texas,Fort Worth,United States,76108,$60000/$250,$24,
07/29/2018,Beacon International,863949,020,00072,ARS-01-0043116,201823108,,,,Reason,Ian,M,05/27/1964,male,10717 Verna Trl W,Texas,Fort Worth,United States,76108,$60000/$250,$41.6,
07/29/2018,Beacon International,863949,020,00072,ARS-01-0043115,201823106,,,,Mizen,Jason,C,09/25/1987,male,5/357 Canning Highway,,Como,Australia,6152,$60000/$250,$16.2,
07/29/2018,Beacon International,863949,020,00072,ARS-01-0043114,201823103,,,,Geystrin,Pavel,,04/12/1986,male,2 pulaski st,New York,brooklyn,United States,11206,$550000/$0,$16.88,
07/29/2018,Beacon International,863949,020,00072,ARS-01-0043113,201823102,,,,Nelson,Hilary,,03/04/1975,female,563 28th St,California,San Francisco,United States,94131,$60000/$250,$19.5,
07/29/2018,Beacon International,863949,020,00072,ARS-01-0043112,201823101,,,,Flagg,Cory,Erin,06/23/1982,female,20868 W Elm Way,Arizona,Buckeye,United States,85396,$2000000/$0,$24.53,
07/29/2018,Beacon International,863949,020,00072,ARS-01-0043111,201823101,,,,Flagg,Matthew,P,08/06/1982,male,20868 W Elm Way,Arizona,Buckeye,United States,85396,$2000000/$0,$24.53,
07/29/2018,Beacon International,863949,020,00072,ARS-01-0043110,201823098,,,,Gancz,Leah,,10/31/1994,female,1016 East 31st street,New York,Brooklyn,United States,11210,$110000/$0,$39.19,
07/29/2018,Beacon America,863949,020,00072,ARS-02-0043109,201823094,,,,BLACKWELL,Trevor,O,11/04/1969,male,1300 Bear Gulch Road,California,Woodside,United States,94062,$1100000/$250,$45.97,
07/29/2018,Beacon America,863949,020,00072,ARS-02-0043108,201823091,,,,BLACKAPPL,Dominika,,09/09/1974,female,1300 Bear Gulch Road,California,Woodside,United States,94062,$1100000/$250,$45.97,
07/28/2018,Beacon International,863949,020,00072,ARS-01-0043106,201806343,,,,daga,Arun,,02/10/1943,male,6709 the masters ave,Florida,Bradenton,United States,34202,$50000/$250,$57.5,
07/28/2018,Beacon International,863949,020,00072,ARS-01-0043105,201806342,,,,daga,sharon,J,05/16/1943,female,6709 the masters ave,Florida,Bradenton,United States,34202,$50000/$250,$57.5,
07/28/2018,Beacon International,863949,020,00072,ARS-01-0043104,201806340,Passport(N3800935),,,Knott,Craig,C,09/03/1992,male,115 Sandra Muraida way,Texas,Austin,United States,78703,$550000/$1000,$10.3,
07/29/2018,Beacon America,863949,020,00072,ARS-02-0043103,201806339,,,,GAURET,SWAN,J,11/17/2003,male,BLOCK 28-1B-COASTAL ROSE GARDEN 1,,SHENZHEN,China,518000,$60000/$250,$14.39,
07/29/2018,Beacon America,863949,020,00072,ARS-02-0043102,201806338,Passport(ka4102323),,,khan,faizan,a,06/20/1987,male,49 chrome ave,NJ,carteret,United States,07008,$60000/$0,$38.95,
07/28/2018,Beacon International,863949,020,00072,ARS-01-0043101,201806337,,,,Emelianov,Andrey,,05/24/1983,male,2250 Monroe St 156,California,Santa Clara,United States,95050,$60000/$0,$20.25,
07/27/2018,Beacon International,863949,020,00072,ARS-01-0043100,201817461,,,,Butler,Christopher,c,04/15/1975,male,201 Martin circle,Florida,Royal Palm Beach,United States,33411,$60000/$250,$25.5,
07/27/2018,Beacon International,863949,020,00072,ARS-01-0043082,201817378,,,,Shiau,Frank,,03/18/1976,male,4630 Center Blvd.,New York,Long Island City,United States,11109,$1100000/$0,$22.5,
07/27/2018,Beacon International,863949,020,00072,ARS-01-0043079,201817375,,,,Boyd,Mei,T,05/01/1990,female,15791 Bear Creek Pkwy,Washington,Redmond,United States,98052,$60000/$0,$9.5,
07/27/2018,Beacon International,863949,020,00072,ARS-01-0043078,201817375,,,,Boyd,Cameron,M,01/05/1988,male,15791 Bear Creek Pkwy,Washington,Redmond,United States,98052,$60000/$0,$11.25,
07/27/2018,Beacon International,863949,020,00072,ARS-01-0043077,201817372,,,,Sanderson,Tobias,,11/09/1972,male,690 Guerrero St,California,San Francisco,United States,94110,$1100000/$0,$35,
07/29/2018,Beacon International,863949,020,00072,ARS-01-0043072,201817353,,,,Schwartz,Moses,,09/17/1968,male,1009 West Kennedy Blvd,New Jersey,Lakewood,United States,08701,$550000/$250,$15.68,
07/29/2018,Beacon International,863949,020,00072,ARS-01-0043071,201817353,,,,Schwartz,Chany,,12/13/1969,female,1009 West Kennedy Blvd,New Jersey,Lakewood,United States,08701,$550000/$250,$15.68,
07/28/2018,Beacon International,863949,020,00072,ARS-01-0043064,201808523,,,,Klinger,Scott,M,05/30/1979,male,B111/35 Arncliffe Street,,Wolli Creek,Australia,2205,$60000/$0,$7.88,
07/28/2018,Beacon International,863949,020,00072,ARS-01-0043063,201808522,,,,Yuen,Ching Man Janet,,07/13/1983,female,B111/35 Arncliffe Street,,Wolli Creek,Australia,2205,$60000/$0,$7.88,
07/26/2018,OverseasCare Visitors Insurance Plan,863949,020,00072,OVI-28-0043062,201808521,Passport(J5044565),,,Dutta,Dipali,,03/16/1942,female,10 wayfarer,California,irvine,United States,92614,$110000/$250,$317.2,
07/27/2018,Beacon America,863949,020,00072,ARS-02-0043061,201808520,,,,Friedman,Chana ,,09/18/1998,female,4 Plymouth Pl,New York,Airmont,United States,10952,$60000/$0,$7.75,
07/27/2018,Beacon America,863949,020,00072,ARS-02-0043060,201808519,,,,Friedman,Rivka ,,01/10/1997,female,4 Plymouth Pl,New York,Airmont,United States,10952,$60000/$0,$7.75,
07/27/2018,Beacon America,863949,020,00072,ARS-02-0043059,201808518,,,,Friedman ,Devorah ,,01/21/1975,female,4 Plymouth Pl,New York,Airmont,United States,10952,$60000/$0,$15.31,
07/26/2018,Clear America,863949,020,00072,ARS-05-0043056,201808514,Passport(522192313),,,Basil,Madison,Martin,04/02/1994,female,119 Riverview Drive,West Virginia,Elkins,United States,26241,$2000000/$5000,$778,
07/26/2018,Beacon International,863949,020,00072,ARS-01-0043057,201808515,Passport(AQ926746),,,Rodriguez Sarasty,Jesus,A,09/27/1980,male,2800 Avenue Van Horne,Quebec,Montreal,Canada,H3S 1P9,$60000/$250,$13.5,
07/26/2018,Beacon International,863949,020,00072,ARS-01-0043055,201808513,,,,Rodriguez Sarasty,Jesus,M,09/27/1980,male,2800 Avenue Van Horne,Quebec,Montreal,Canada,H3S1P9,$60000/$250,$13.5,
07/26/2018,Beacon America,863949,020,00072,ARS-02-0043054,201808512,,,,WILKINSON,SOFIA,A,01/14/2013,female,FLAT 5 SIDMOUTH LODGE,,LONDON,United Kingdom,SW2 2YG,$110000/$0,$14,
07/26/2018,Beacon America,863949,020,00072,ARS-02-0043053,201808511,,,,ISAZA,Sonia,A,08/19/1973,female,FLAT 5 SIDMOUTH LODGE,,LONDON,United Kingdom,SW2 2YG,$110000/$0,$29.8,
07/26/2018,Beacon America,863949,020,00072,ARS-02-0043052,201808510,,,,Basch,Moshe,,08/03/2013,male,980 Park Ave,New Jersey,Lakewood,United States,08701,$1100000/$0,$12.5,
07/26/2018,Beacon America,863949,020,00072,ARS-02-0043051,201808509,,,,Basch,David,,07/09/2012,male,980 Park Ave,New Jersey,Lakewood,United States,08701,$1100000/$0,$12.5,
07/26/2018,Beacon America,863949,020,00072,ARS-02-0043050,201808508,,,,Basch,Risa,,09/18/1990,female,980 Park Ave,New Jersey,Lakewood,United States,08701,$1100000/$0,$14.88,
07/26/2018,Beacon America,863949,020,00072,ARS-02-0043049,201808507,,,,Basch,Shlomo,,04/28/1987,male,980 Park Ave,New Jersey,Lakewood,United States,08701,$1100000/$0,$18.88,
07/26/2018,OverseasCare Visitors Insurance Plan,863949,020,00072,OVI-28-0043048,201808506,,,,Patel,Meenaben,,04/29/1956,male,34175 Valley Drive,California,Union City,United States,94587,$60000/$500,$147.84,
07/26/2018,OverseasCare Visitors Insurance Plan,863949,020,00072,OVI-28-0043047,201808505,,,,Patel,Vishnubhai,,03/24/1950,male,34175 Valley Drive,California,Union City,United States,94587,$60000/$500,$147.84,
07/26/2018,Beacon International,863949,020,00072,ARS-01-0043046,201808504,,,,Diab,Jessica,,11/17/1987,female,58 Links Lane,Ontario,Brampton,Canada,L6Y 5H1,$1100000/$100,$22.77,
07/27/2018,Beacon International,863949,020,00072,ARS-01-0043045,201808503,,,,Rambatt Jr,Kenneth,A,12/24/1961,male,PO Box 160,Wisconsin,Sharon,United States,53585,$550000/$0,$23.1,
07/27/2018,Beacon International,863949,020,00072,ARS-01-0043044,201808502,,,,Rambatt,Betty,J,02/25/1968,female,PO Box 160,Wisconsin,Sharon,United States,53585,$550000/$0,$23.1,
07/26/2018,Beacon International,863949,020,00072,ARS-01-0043041,201808498,,,,Hatton,Carol,,12/28/1943,female,8049 Tysons Oaks Ct,Virginia,Gainesville,United States,20155,$50000/$250,$28.75,
07/26/2018,Beacon International,863949,020,00072,ARS-01-0043040,201888921,,,,Jones,Taylor,,02/12/1986,male,1230 Lehman,Texas,Houston,United States,77018,$60000/$250,$7.2,
07/26/2018,Beacon International,863949,020,00072,ARS-01-0043037,201888918,,,,Nagaraj,Anupama,,05/03/1979,female,60 Broadway,New York,Brooklyn,United States,11249,$60000/$0,$33.75,
07/26/2018,Beacon America,863949,020,00072,ARS-02-0043035,201888916,,,,Linford,Tania,,07/10/1974,female,14 Wentworth park,,Auckland,New Zealand,0626,$60000/$250,$12.25,
07/26/2018,Beacon America,863949,020,00072,ARS-02-0043034,201888915,,,,Coffey,Steve,,01/06/1973,male,14 Wentworth park,,Auckland,New Zealand,0626,$60000/$250,$12.25,
07/26/2018,OverseasCare Visitors Insurance Plan,863949,020,00072,OVI-28-0041211,201888914,Passport(H3554716),,,Bhatkar,Vishnu,A,02/27/1946,male,1512 Olympic Circle East,Pennsylvania,WHITEHALL,United States,18052,$60000/$500,$38.57,
07/26/2018,OverseasCare Visitors Insurance Plan,863949,020,00072,OVI-28-0041210,201838747,Passport(H3554716),,,Atmaram,Shashikant,Bhatkar,04/07/1942,male,1512 Olympic Circle East,Pennsylvania,WHITEHALL,United States,18052,$60000/$500,$38.57,
07/25/2018,Beacon International,863949,020,00072,ARS-01-0043033,201818570,,,,Hershkovits,Simcha,,11/08/1996,male,1432 52nd street,New York,Brooklyn,United States,11219,$1100000/$0,$10.33,
07/25/2018,Beacon America,863949,020,00072,ARS-02-0043032,201818548,,,,Rogers,Lindsay,,03/28/1987,female,299 Devoe St,New York,Brooklyn,United States,11211,$60000/$250,$21.32,
07/25/2018,Beacon International,863949,020,00072,ARS-01-0043031,201818547,Passport(022953517),,,LORETO,PAOLA,,12/27/1997,female,14221 SW 120th ST STE 127,Florida,Miami,Venezuela,33186,$60000/$500,$101.92,
07/25/2018,OverseasCare Visitors Insurance Plan,863949,020,00072,OVI-28-0043030,201818546,Passport(J0878203),,,Ariram Nadar,Narayanaperumal,,03/06/1952,male,361 WASHINGTON DR,,MILPITAS,United States,95035,$60000/$250,$193.23,
07/25/2018,OverseasCare Visitors Insurance Plan,863949,020,00072,OVI-28-0043029,201818545,Passport(J0878203),,,Narayanaperumal,Thangakani,,06/03/1958,female,361 WASHINGTON DR,,MILPITAS,United States,95035,$60000/$250,$193.23,
07/25/2018,Beacon International,863949,020,00072,ARS-01-0043026,201818408,Passport(525077185),,,Wepplo,Suzanne ,,11/12/1981,female,2610 Vincent Ave n,Minnesota,Minneapolis,United States,55411,$110000/$100,$199.23,
07/26/2018,Beacon America,863949,020,00072,ARS-02-0043024,201818406,Passport(AQ344952),,,NOCUA HENAO,JOSE ABEL,,11/25/1995,male,Calle 55 sur # 24a -44,Distrito Capltal de Santa Fe de Bogot&atilde;,BOGOTA,Colombia,057,$60000/$500,$5.58,
07/28/2018,Beacon International,863949,020,00072,ARS-01-0035520,201818369,Passport(474882584),,,Fuechsel,Martha,C,02/20/1994,female,335 Waterloo,Virginia,Warrington,United States,20186,$1100000/$0,$536.9,
07/25/2018,Beacon America,863949,020,00072,ARS-02-0043018,201818356,Passport(P-547535),,,pestana da silva,maria ,z,12/24/1950,male,2720 State st,Connecticut,Hamden,United States,06517,$1100000/$1000,$426.88,
07/25/2018,OverseasCare Visitors Insurance Plan,863949,020,00072,OVI-28-0043015,201818353,Passport(Z3717804),,,Pinninti,Madhulatha,,08/15/1973,female,3494 New Fawn Ln,Georgia,Alpharetta,United States,30004,$60000/$100,$108.9,
07/26/2018,Beacon International,863949,020,00072,ARS-01-0043014,201818352,,,,Martinek,Lucy,C,07/15/1985,female,45 Stuart St,Massachusetts,Boston,United States,02116-4765,$60000/$250,$42.3,
07/26/2018,Beacon International,863949,020,00072,ARS-01-0043013,201818351,,,,Hartley,Brigham,J,11/16/1984,male,45 Stuart St,Massachusetts,Boston,United States,02116-4765,$60000/$250,$42.3,
07/25/2018,Beacon International,863949,020,00072,ARS-01-0043011,201818196,,,,Vahos,Robert,B,12/26/1994,male,12 Orchard Street,New York,Cold Spring,United States,10516,$1100000/$250,$197.89,
07/26/2018,Beacon International,863949,020,00072,ARS-01-0043009,201818166,,,,Mayes,Thomas,A,02/16/1970,male,1510 32nd Street,Iowa,Des Moines,United States,50311,$60000/$250,$11.7,
07/25/2018,Beacon International,863949,020,00072,ARS-01-0043008,201818165,,,,Jurkansky,Yaakov,,01/07/1991,male,234 Governors Road,New Jersey,Lakewood,United States,08701,$2000000/$0,$32.8,
07/24/2018,Beacon International,863949,020,00072,ARS-01-0043007,201818108,,,,Burton,Darby,A,10/02/1998,female,2930 146th Street West Apt 332,Minnesota,Rosemount,United States,55068,$110000/$100,$30.31,
07/24/2018,Beacon International,863949,020,00072,ARS-01-0043006,201818107,,,,Cricke,Curtis,D,05/30/1980,male,202 10th Ave N,Florida,Safety Harbor,United States,34695,$110000/$0,$9.45,
07/24/2018,Beacon International,863949,020,00072,ARS-01-0043005,201818106,,,,Davis,Phillip,A,05/28/1970,male,202 10th Ave N,Florida,Safety Harbor,United States,34695,$110000/$0,$15.75,
07/24/2018,Beacon International,863949,020,00072,ARS-01-0043004,201818105,,,,Ayala,david,H,06/06/1970,male,202 10th Ave N,Florida,Safety Harbor,United States,34695,$110000/$0,$15.75,
07/28/2018,Essential America,863949,020,00072,ARS-03-0042929,201890728,Passport(C1964924),,,NGO,PHUONG BICH,THI,03/07/1985,female,679 S. MORNINGSTAR DRIVE,California,ANAHEIM,United States,92808,$5000000/$5000,$875,
07/28/2018,Essential America,863949,020,00072,ARS-03-0042929,201890730,,Passport(C3577615),Dependant,NGO,BACH,HUYNH,01/18/2014,male,679 S. MORNINGSTAR DRIVE,California,ANAHEIM,United States,92808,$5000000/$5000,$321,
07/24/2018,Beacon International,863949,020,00072,ARS-01-0043002,201818079,,,,Ananida,Myrto,,11/23/1991,female,Nybrovej 304,,Kgs. Lyngby,Denmark,2800,$60000/$250,$3.8,
07/24/2018,Beacon International,863949,020,00072,ARS-01-0042997,201818067,Passport(537672860),,,Timmons,Gloria,A,08/01/1973,female,17451 Bastanchury Road Suite 203,California,Yorba Linda,United States,92886,$1100000/$250,$30,
07/24/2018,Beacon International,863949,020,00072,ARS-01-0042994,201818060,,,,Douglass,Judah,J,09/09/2006,male,17451 Bastanchury Road Suite 203,California,Yorba Linda,United States,92886,$1100000/$250,$16.5,
07/24/2018,Beacon International,863949,020,00072,ARS-01-0042993,201818059,,,,Douglass,Lila,E,12/03/2004,female,17451 Bastanchury Road Suite 203,California,Yorba Linda,United States,92886,$1100000/$250,$16.5,
07/24/2018,Beacon International,863949,020,00072,ARS-01-0042992,201818058,,,,Douglass,Heidi,L,12/15/1972,female,17451 Bastanchury Road Suite 203,California,Yorba Linda,United States,92886,$1100000/$250,$30,
07/24/2018,Beacon International,863949,020,00072,ARS-01-0042991,201818057,Passport(548665352),,,Douglass,Robert,J,11/14/1971,male,17451 Bastanchury Road Suite 203,California,Yorba Linda,United States,92886,$1100000/$250,$30,
07/24/2018,Beacon International,863949,020,00072,ARS-01-0042990,201818056,,,,Becker,Daniel,K,12/21/1988,male,312 Louise Avenue,North Carolina,High Point,United States,27262,$60000/$0,$4.75,
07/24/2018,Beacon International,863949,020,00072,ARS-01-0042989,201818055,,,,Overby,Caitlyn,C,07/26/1991,female,312 Louise Avenue,North Carolina,High Point,United States,27262,$60000/$0,$4.75,
07/23/2018,Beacon America,863949,020,00072,ARS-02-0042985,201818041,Passport(116173793),,,Abarca Runciman,Sebastian,E,11/26/1997,male,5349 Coach Dr,CA,El Sobrante,United States,94803,$550000/$0,$16.35,
07/26/2018,OverseasCare Visitors Insurance Plan,863949,020,00072,OVI-28-0042983,201818002,Passport(216220315),,,Cortez,Esperanza,M,11/14/1966,female,77 Walnut St,New Jersey,Livingston,United States,07039,$60000/$500,$15.24,
07/23/2018,Beacon International,863949,020,00072,ARS-01-0042980,201817992,Passport(I190995),,,Caneda,luis,alberto,08/19/1963,male,168 w 16th st,,hialeah,United States,33010,$1100000/$0,$19.63,
07/25/2018,OverseasCare Visitors Insurance Plan,863949,020,00072,OVI-28-0042977,201817989,Passport(116025684),,,Cortez Ortiz,Lourdes,M,11/14/1966,female,77 Walnut St,New Jersey,Livingston,United States Minor,07039,$60000/$500,$30.48,
07/24/2018,Beacon America,863949,020,00072,ARS-02-0040199,201817985,,,,Adema,Marissa Ann,,06/05/1981,female,7457 E Portobello Ave,Arizona,Mesa,United States,85212,$550000/$500,$71.98,
07/23/2018,Beacon International,863949,020,00072,ARS-01-0042972,201817983,Passport(305943140),,,Schmidt,Erica,R,02/03/1985,female,3313 S US Highway 421,Indiana,Greensburg,United States,47240,$2000000/$250,$202.74,
07/23/2018,Beacon America,863949,020,00072,ARS-02-0042970,201817981,,,,Cohen,Nissin,,10/25/2016,male,212 Stratford Place,New Jersey,Lakewood,United States,08701,$110000/$0,$14,
07/23/2018,Beacon America,863949,020,00072,ARS-02-0042969,201817980,,,,Cohen,Avraham T,,10/15/2014,male,212 Stratford Place,New Jersey,Lakewood,United States,08701,$110000/$0,$14,
07/23/2018,Beacon America,863949,020,00072,ARS-02-0042968,201817979,,,,Cohen,Yael,,08/04/1993,female,212 Stratford Place,New Jersey,Lakewood,United States,08701,$110000/$0,$15.4,
07/23/2018,Beacon America,863949,020,00072,ARS-02-0042967,201817978,,,,Cohen,Mordechai,,08/26/1990,male,212 Stratford Place,New Jersey,Lakewood,United States,08701,$110000/$0,$15.4,
07/24/2018,Beacon International,863949,020,00072,ARS-01-0042963,201817279,,,,Gatti,Enrico,,04/17/1981,male,794 Hart st,New York,Brooklyn,United States,11237,$1100000/$250,$22.08,
07/24/2018,Beacon America,863949,020,00072,ARS-02-0042953,201891070,,,,Partington,Philip,C,07/14/1988,male,Wangsimni-ro 96,,Seoul,,04778,$60000/$250,$26.24,
07/28/2018,Beacon International,863949,020,00072,ARS-01-0042950,201891067,Passport(549515398),,,Costa,Frank,P,09/29/1945,male,8320 W 126th Street,Illinois,Palos Park,United States,60464,$50000/$0,$64.69,
07/29/2018,Beacon America,863949,020,00072,ARS-02-0042938,201890743,,,,SOOKOO,SUNIL,,02/20/1976,male,2425 Wilson Blvd. Suite 350,Virginia,Arlington,United States,22201,$60000/$0,$42.88,
07/29/2018,Beacon America,863949,020,00072,ARS-02-0042937,201890742,,,,PHILIP,NOEL,,12/19/1966,male,2425 Wilson Blvd. Suite 350,Virginia,Arlington,United States,22201,$60000/$0,$63,
07/29/2018,Beacon America,863949,020,00072,ARS-02-0042936,201890741,,,,JOSEPH,MARLON,,07/21/1970,male,2425 Wilson Blvd. Suite 350,Virginia,Arlington,United States,22201,$60000/$0,$42.88,
07/29/2018,Beacon America,863949,020,00072,ARS-02-0042935,201890740,,,,BARROW,JOEL,,09/11/1976,male,2425 Wilson Blvd. Suite 350,Virginia,Arlington,United States,22201,$60000/$0,$42.88,
07/29/2018,Beacon America,863949,020,00072,ARS-02-0042934,201890739,,,,LEGENDRE,HAROLD,,06/23/1969,male,2425 Wilson Blvd. Suite 350,Virginia,Arlington,United States,22201,$60000/$0,$42.88,
07/29/2018,Beacon America,863949,020,00072,ARS-02-0042933,201890736,,,,GUADA,GARTH,,04/02/1975,male,2425 Wilson Blvd. Suite 350,Virginia,Arlington,United States,22201,$60000/$0,$42.88,
07/29/2018,Beacon America,863949,020,00072,ARS-02-0042932,201890733,,,,MARSHALL,DAVID,,09/19/1974,male,2425 Wilson Blvd. Suite 350,Virginia,Arlington,United States,22201,$60000/$0,$42.88,
07/29/2018,Beacon America,863949,020,00072,ARS-02-0042931,201890732,,,,CYRUS,DARRYL ,,03/23/1971,male,2425 Wilson Blvd. Suite 350,Virginia,Arlington,United States,22201,$60000/$0,$42.88,
07/29/2018,Beacon America,863949,020,00072,ARS-02-0042930,201890731,,,,FRASER,CLINT,,04/02/1970,male,2425 Wilson Blvd. Suite 350,Virginia,Arlington,United States,22201,$60000/$0,$42.88,
07/29/2018,Beacon America,863949,020,00072,ARS-02-0042928,201890727,,,,LOGAN,ARNOLD,,10/24/1970,male,2425 Wilson Blvd. Suite 350,Virginia,Arlington,United States,22201,$60000/$0,$42.88,
07/27/2018,Beacon International,863949,020,00072,ARS-01-0042925,201890718,Passport(452043949),,,Childress,Patrick,G,12/30/1950,male,411 Walnut St PMB 9142,,Green Cove Springs,United States,32043,$110000/$2500,$1082.9,
07/23/2018,Beacon International,863949,020,00072,ARS-01-0042923,201890716,Passport(483055722),,,Wissink,Rebekah Marie,,10/09/1991,female,1700 28th St SE,Michigan,Grand Rapids,United States,49508,$1100000/$0,$473.48,
07/27/2018,Beacon America,863949,020,00072,ARS-02-0042909,201890350,Passport(A05767077),,,Mulero,Muibi,,04/19/1964,male,12125 Woodcrest Executive Dr Ste 100,MO,Saint Louis,United States,63141,$110000/$0,$51.53,
07/24/2018,Beacon America,863949,020,00072,ARS-02-0042906,201890346,Passport(481605397),,,Lopez,Ava,,04/13/2010,female,2155 W PINNACLE PEAK RD,ARIZONA,PHOENIX,United States,85027,$1100000/$500,$38.48,
07/24/2018,Beacon America,863949,020,00072,ARS-02-0042905,201890345,Passport(450649813),,,LOPEZ,GRACE ,SOPHIA,12/13/2008,female,2155 W Pinnacle Peak Rd,Arizona,Phoenix,United States,85027,$1100000/$500,$38.48,
07/29/2018,Beacon International,863949,020,00072,ARS-01-0042899,201890311,,,,Gebrengus,Erget,H,01/01/1981,male,Mhram chira,,Asmara,Eritrea,107,$60000/$250,$6.3,
07/23/2018,Beacon America,863949,020,00072,ARS-02-0042896,201890304,,,,Xu,Fei,,11/10/1972,female,185-602 Jiyuan Rd. Jimei District,,Xiamen,China,361021,$60000/$0,$70.44,
07/23/2018,Beacon America,863949,020,00072,ARS-02-0042895,201890303,,,,Lu,Jinping,,08/20/1966,male,185-602 Jiyuan Rd. Jimei District,,Xiamen,China,361021,$60000/$0,$103.5,
07/23/2018,Beacon America,863949,020,00072,ARS-02-0042894,201890302,,,,Lu,Rongze,,03/01/1962,male,185-602 Jiyuan Rd. Jimei District,,Xiamen,China,361021,$60000/$0,$103.5,
07/23/2018,Beacon America,863949,020,00072,ARS-02-0042893,201890301,,,,Zhang,Jiemin,,11/01/1964,female,185-602 Jiyuan Rd. Jimei District,,Xiamen,China,361021,$60000/$0,$103.5,
07/23/2018,Beacon America,863949,020,00072,ARS-02-0042892,201890300,,,,Lu,JInsheng,,05/29/1964,male,185-602 Jiyuan Rd. Jimei District,,Xiamen,China,361021,$60000/$0,$103.5,
07/24/2018,Beacon International,863949,020,00072,ARS-01-0042887,201890140,Passport(480893658),,,Binkley,Ethan,,11/21/1992,male,108 Johnathan Ct,Kentucky,Hodgenville,United States,42748,$1100000/$0,$22.13,
07/25/2018,Beacon International,863949,020,00072,ARS-01-0042884,201890128,,,,Abdulmejed,Fatuma,A,07/08/1970,female,Hai malakal,,Juba,Eritrea,81111,$60000/$250,$18,
07/29/2018,Beacon International,863949,020,00072,ARS-01-0042883,201890103,Passport(532139571),,,Rabkin,Rachel,,07/25/1995,female,502 Crown Street,New York,Brooklyn,United States,11213,$2000000/$0,$39.98,
07/25/2018,Beacon International,863949,020,00072,ARS-01-0042879,201890099,,,,DeWelt,Carol ,,12/07/1950,female,4311 Newman Rd,Missouri,Joplin,United States,64801,$110000/$100,$28.05,
07/25/2018,Beacon International,863949,020,00072,ARS-01-0042878,201890098,Passport(545552257),,,DeWelt,Christopher,,01/19/1952,male,4311 Newman Rd,Missouri,Joplin,United States,64801,$110000/$100,$28.05,
07/25/2018,Beacon International,863949,020,00072,ARS-01-0042857,201889970,,,,Hayle,Soliyana,H,10/28/1996,female,Atlae bara,,Juba,Eritrea,81111,$60000/$250,$9.12,
07/28/2018,Beacon International,863949,020,00072,ARS-01-0042854,201889967,Passport(561755080),,,Humphrey,George,A,10/11/1950,male,2603 tanglewood trail,Texas,austin,United States,78703,$110000/$2500,$377.83,
07/25/2018,Beacon International,863949,020,00072,ARS-01-0042853,201889966,,,,Abraham,Abiselom,D,08/15/1997,male,Atlae bara,,Juba,Eritrea,81111,$60000/$250,$9.12,