Original Effective Date,Plan Type,Control,Suffix,Account,Policy Number,ID,EE SSN,Dependent SSN,Dependent Relationship,Last Name,First Name,Middle Initial,DOB,Gender,Address,State,City,Country,Postcode,Max/Ded,Premium,
05/11/2018,Essential America,863949,020,00072,ARS-03-0042312,201823292,Passport(00000),,,Littlepage,John,Richard,04/12/2018,male,6 Isabella Avenue,,Port of Spain,Trinidad And Tobago,00000,$5000000/$1000,$400,
05/31/2018,Beacon International,863949,020,00072,ARS-01-0041529,201802712,,,,Ophir,Elad,,11/21/1987,male,211 W 56th St.,New York,NEW YORK,United States,10019,$60000/$250,$20.7,
05/31/2018,Beacon International,863949,020,00072,ARS-01-0041515,201802618,,,,Gauthier,Madeline,M,09/11/1992,female,417 STONEHEDGE CT,Wisconsin,RIPON,United States,54971,$1100000/$2500,$9.91,
05/31/2018,Beacon International,863949,020,00072,ARS-01-0041514,201802617,,,,Gauthier,Judith,L,09/09/1962,female,417 STONEHEDGE CT,Wisconsin,RIPON,United States,54971,$1100000/$2500,$26.38,
05/31/2018,Beacon International,863949,020,00072,ARS-01-0041513,201802616,,,,Gauthier,Richard,J,04/07/1959,male,417 STONEHEDGE CT,Wisconsin,RIPON,United States,54971,$1100000/$2500,$26.38,
05/30/2018,Beacon International,863949,020,00072,ARS-01-0041507,201802587,,,,Shukla,Amitava,,12/11/1985,male,3901 West State Road 84 Apt. 205,Florida,Davie,United States,33312,$550000/$250,$16.2,
05/30/2018,Beacon International,863949,020,00072,ARS-01-0041496,201802456,,,,LEWIS,ALLISON,M,03/15/1999,female,1336 N BROWN AVE,Missouri,Springfield,United States,65802,$2000000/$250,$36.24,
05/30/2018,Beacon America,863949,020,00072,ARS-02-0041492,201802436,,,,Barnech,Mariana,,07/03/1986,female,50 Belbourie Crescent,,Boomerang Beach,Australia,2428,$60000/$250,$114.8,
05/30/2018,Beacon International,863949,020,00072,ARS-01-0041491,201802435,,,,Triegaardt,Adriana,,04/16/1934,female,9 Adylinn Road,,Harare,Zimbabwe,0000,$12000/$250,$129,
05/31/2018,Beacon America,863949,020,00072,ARS-02-0041485,201802172,Passport(N1975648),,,Bhargava,Lakshman ,K,11/27/1947,male,15942 NW Rossetta Street,Oregon,Portland,United States,79229,$50000/$100,$1227.6,
05/31/2018,Beacon America,863949,020,00072,ARS-02-0041484,201802171,Passport(N1975371),,,Bhargava,Manju,,07/23/1955,female,15942 NW Rossetta Street,Oregon,Portland,United States,79229,$60000/$100,$767.25,
05/29/2018,Beacon America,863949,020,00072,ARS-02-0041463,201802105,Passport(E24687754),,,Zhou,Zixuan,,04/19/2000,female,1542 Downy Birch Ln,Fl,Longwood,United States Minor,32750,$60000/$500,$563.09,
05/29/2018,Beacon International,863949,020,00072,ARS-01-0041458,201802098,,,,Bell,Horace,J,11/13/1951,male,240 Sand Key Estates Drive,Florida,Clearwater Beach,United States,33767,$60000/$250,$93.12,
05/29/2018,Beacon International,863949,020,00072,ARS-01-0041457,201802097,,,,Bell,Pamala,H,06/16/1953,female,240 Sand Key Estates Drive,Florida,Clearwater Beach,United States,33767,$60000/$250,$78,
05/29/2018,Beacon International,863949,020,00072,ARS-01-0041452,201801836,,,,Strom,Summer,,10/06/2000,female,48-324 Loihi Rd,Hawaii,Honokaa,United States,92767,$1100000/$250,$28.6,
05/29/2018,Beacon International,863949,020,00072,ARS-01-0041451,201801835,,,,Forbes,Aravel,,05/04/1964,female,48-324 Loihi Rd,Hawaii,Honokaa,United States,92767,$1100000/$250,$81.64,
05/30/2018,Beacon International,863949,020,00072,ARS-01-0041449,201801833,Passport(485504980),,,Horvath,Courtney,N,01/08/1992,female,2600 Cloversprings Lane,Tennessee,Franklin,United States,37067,$1100000/$0,$55.61,
05/30/2018,Beacon International,863949,020,00072,ARS-01-0041448,201801832,Passport(582361791),,,Zimmerman,Zachary,T,12/06/1986,male,1115 KY hwy 16,Kentucky,Glencoe,United States,41046,$1100000/$0,$65.04,
05/28/2018,Beacon America,863949,020,00072,ARS-02-0041447,201801831,,,,kuppuswamy,balasubramanyam,,06/01/1955,male,5770 dichondra pl,California,newark,United States,94560,$550000/$1000,$644,
05/28/2018,Beacon America,863949,020,00072,ARS-02-0041446,201801830,,,,balasubramanyam,krishna kumari,,07/15/1963,female,5770 dichondra pl,California,newark,United States,94560,$550000/$1000,$518.88,
05/29/2018,Beacon International,863949,020,00072,ARS-01-0041445,201801829,,,,French,Erin,,12/06/1982,female,15737 NE 59th Way,Washington,Remond,United States,98052,$1100000/$0,$8.63,
05/29/2018,Beacon America,863949,020,00072,ARS-02-0041444,201801828,Passport(024165453),,,Hernandez Velazco,Laura,A,02/09/1987,female,16 se 12 street,Florida,Dania,Venezuela,33004,$60000/$0,$65.6,
05/29/2018,Beacon International,863949,020,00072,ARS-01-0041443,201801827,Passport(503570192),,,moreno,paola,C,03/12/1994,female,4812 N 68th Pl,Arizona,Scottsdale,United States,85251,$60000/$0,$97.57,
05/28/2018,Beacon America,863949,020,00072,ARS-02-0041442,201801573,Passport(M2170163),,,Gopinath,Thilagam,,04/05/1960,female,1245 lakeside drive,California,Sunnyvale,United States,94085,$110000/$500,$717.23,
05/28/2018,Beacon International,863949,020,00072,ARS-01-0041439,201801568,,,,Weger,Heidi,,07/16/1966,female,3450 South Ocean Blvd #807,Florida,Palm Beach,United States,33480,$550000/$250,$49.28,
05/28/2018,Beacon International,863949,020,00072,ARS-01-0041438,201801567,,,,Snell,Gretchen,,05/15/1962,female,3450 South Ocean Blvd #807,Florida,Palm Beach,United States,33480,$550000/$250,$49.28,
05/29/2018,Beacon America,863949,020,00072,ARS-02-0041435,201801564,,,,Sundaresan,Rukmani,,11/07/1945,female,2311 Sedgewick ct,Illinois,Naperville,United States,60564,$50000/$2500,$927.36,
05/29/2018,Beacon America,863949,020,00072,ARS-02-0041434,201801563,Passport(K5822268),,,Natesa,Sundaresan,,05/03/1942,male,2311 Sedgewick ct,Illinois,Naperville,United States,60564,$50000/$2500,$927.36,
05/28/2018,Beacon International,863949,020,00072,ARS-01-0041433,201801562,,,,Henderson,Andre,D,12/06/1986,male,1288 Clifton ave,New Jersey,Clifton,United States,07012,$60000/$250,$7.2,
05/28/2018,Beacon International,863949,020,00072,ARS-01-0041431,201801560,Passport(547747989),,,Scoon,Caleb,,05/14/1997,male,759 E Lemon Swirl Dr,California,Azusa,United States,91702,$2000000/$0,$28.7,
05/28/2018,Beacon International,863949,020,00072,ARS-01-0041430,201801559,,,,Balaji,Sujala,,06/15/1982,female,15 Sorauren AVe,Ontario,Toronto,Canada,M6R 2C6,$60000/$250,$10.8,
05/29/2018,Beacon International,863949,020,00072,ARS-01-0041429,201801558,,,,Kidane,Ruta,A,06/29/1981,female,Sembel,,Asmara,Eritrea,107,$60000/$250,$5.4,
05/28/2018,Beacon International,863949,020,00072,ARS-01-0041427,201801556,,,,Gautier,Pierre-Richard,,01/28/1991,male,271 Lenox Rd,New York,Brooklyn,United States,11226,$60000/$250,$6.84,
05/28/2018,Beacon International,863949,020,00072,ARS-01-0041426,201801555,,,,Nwulu,Chika,,03/30/1987,male,271 Lenox Rd,New York,Brooklyn,United States,11226,$60000/$250,$8.1,
05/28/2018,OverseasCare Visitors Insurance Plan,863949,020,00072,OVI-28-0041425,201801554,Passport(P4208329),,,Kaviraj Ramaya Ganesa,Sattanathan,,04/09/1956,male,3950 Spring Valley RD,Texas,Farmers Branch,United States,75244,$60000/$100,$295.16,
05/31/2018,Beacon International,863949,020,00072,ARS-01-0041424,201801553,,,,Kobrick,Ryan,,11/05/1979,male,756 Tumblebrook Dr,Florida,Port Orange,United States,32127,$60000/$250,$61.2,
05/31/2018,Beacon International,863949,020,00072,ARS-01-0041423,201801552,,,,Kobrick,Jen,,06/25/1986,female,756 Tumblebrook Dr,Florida,Port Orange,United States,32127,$60000/$250,$61.2,
05/31/2018,Beacon International,863949,020,00072,ARS-01-0041422,201801551,,,,Kobrick,Rafael,,07/16/2015,male,756 Tumblebrook Dr,Florida,Port Orange,United States,32127,$60000/$250,$47.6,
05/29/2018,OverseasCare Visitors Insurance Plan,863949,020,00072,OVI-28-0041421,201801550,Passport(J7863016),,,Dindukurthi,Muddu Rangaiah,,12/18/1943,male,10579 Helen Dr,Texas,Frisco,United States,75035,$110000/$250,$239.2,
05/27/2018,Beacon International,863949,020,00072,ARS-01-0041419,201801548,Passport(482535552),,,Kulla,Brenna,L,03/09/1993,female,17451 Bastanchury Road Suite 203,,Yorba Linda,United States,92886,$1100000/$250,$11.8,
05/27/2018,Beacon International,863949,020,00072,ARS-01-0041418,201801547,,,,Hair,Karen,H,12/21/1953,female,903 S Wiggins Rd,Florida,Plant City,United States,33566,$60000/$250,$48.75,
05/27/2018,Beacon International,863949,020,00072,ARS-01-0041414,201801534,,,,Kim,Sukhwan,,06/11/1981,male,1704 DUDLEY LN,New Jersey,Somerset,United States,08873,$110000/$0,$8.1,
05/27/2018,Beacon International,863949,020,00072,ARS-01-0041413,201801533,,,,Kim,Kyoungeun,,12/11/1982,female,1704 DUDLEY LN,New Jersey,Somerset,United States,08873,$110000/$0,$8.1,
05/27/2018,Beacon International,863949,020,00072,ARS-01-0041410,201801530,,,,Feldman,Richard,A,01/14/1960,male,105 27th Ave E,Washington,Seattle,United States,98112,$1100000/$250,$28.26,
05/26/2018,Beacon America,863949,020,00072,ARS-02-0041409,201801318,,,,Lopez,Aaron,S,11/10/1980,male,121 Cleveland ave,Washington,Sumas,United States,98295,$60000/$250,$8.2,
05/26/2018,Beacon International,863949,020,00072,ARS-01-0041407,201801315,,,,Goldstein,Maurice,,04/08/1987,male,49 e 12 st apt 5c,New York,Ny,United States,10003,$60000/$250,$10.8,
05/26/2018,Beacon International,863949,020,00072,ARS-01-0041406,201801314,,,,Stampler,Laura,A,12/22/1987,female,49 e 12 st apt 5c,New York,Ny,United States,10003,$60000/$250,$10.8,
05/30/2018,Beacon America,863949,020,00072,ARS-02-0041405,201801313,Passport(AP0063411),,,Magkini,Souzana,L,12/23/1990,female,256 Larch Row,,Wenham,United States,01984,$1100000/$500,$66.4,
05/27/2018,Beacon America,863949,020,00072,ARS-02-0041191,201830231,,,,Barrie,Chelsea,,10/19/1986,female,c/o 2 North Star Close,Alberta,St. Albert,Canada,T8N 3K1,$1100000/$500,$13.59,
05/27/2018,Beacon International,863949,020,00072,ARS-01-0041403,201801311,,,,GARCIA,ULISES,,09/09/1979,male,GUADALAJARA 203,,XALAPA,Mexico,91130,$60000/$250,$13.5,
05/26/2018,Beacon America,863949,020,00072,ARS-02-0041402,201801310,,,,Livingston Brewley,Dawn,M,09/30/1969,female,Butu Mountain,,Road Town,,VG1110,$110000/$250,$95.36,
05/26/2018,Beacon America,863949,020,00072,ARS-02-0041401,201801309,,,,Brewley,Creightlyn,M,12/02/1996,female,Butu Mountain,,Road Town,,VG1110,$110000/$250,$49.28,
05/26/2018,Beacon International,863949,020,00072,ARS-01-0041400,201801308,,,,Shafer,Benjamin,,01/04/1989,male,280 S Ave 55 Apt 4,California,Los Angeles,United States,90042,$60000/$0,$4.75,
05/26/2018,Beacon International,863949,020,00072,ARS-01-0041399,201801307,,,,MWAI,DAN,T,09/26/1988,male,2000 Baity Hill Drive #114 Chapel Hill North Carolina,North Carolina,Chapel Hill,United States,27514,$60000/$250,$43.32,
05/27/2018,Beacon International,863949,020,00072,ARS-01-0041398,201801306,,,,Riquelme Valle,Christian,J,10/14/2002,male,1403 Felix Aldarondo Ave,,Isabela,Puerto Rico,00662,$60000/$0,$7,
05/27/2018,Beacon International,863949,020,00072,ARS-01-0041397,201801305,,,,Valle Aviles,Nancy,,11/18/1972,female,1403 Felix Aldarondo Ave,,Isabela,Puerto Rico,00662,$60000/$0,$15,
05/27/2018,Beacon International,863949,020,00072,ARS-01-0041396,201801304,,,,Riquelme Rodriguez,Javier,,10/26/1971,male,1403 Felix Aldarondo Ave,,Isabela,Puerto Rico,00662,$60000/$0,$15,
05/25/2018,Beacon America,863949,020,00072,ARS-02-0041386,201801213,,,,Buckle,Ademola,,11/03/1952,male,57 Victoria Street,,Freetown,Sierra Leone,none,$60000/$2500,$262.08,
05/31/2018,Beacon International,863949,020,00072,ARS-01-0041383,201801210,Passport(125268482),,,Parnes,hannah,,02/07/1932,male,1440 54th ST apt1C,,Brooklyn,United States,11219,$12000/$0,$282.19,
05/25/2018,Beacon International,863949,020,00072,ARS-01-0041382,201801209,,,,Semenova,Natalia,,08/15/1989,female,640 Lauder Ave. Apt. 1009,Ontario,Toronto,Canada,M6E 3K1,$60000/$0,$9.88,
05/25/2018,Beacon International,863949,020,00072,ARS-01-0041381,201801208,,,,Semenov,Yulian,,07/04/1986,male,640 Lauder Ave. Apt. 1009,Ontario,Toronto,Canada,M6E 3K1,$60000/$0,$11.7,
05/30/2018,Beacon International,863949,020,00072,ARS-01-0041380,201801207,Passport(539835450),,,Voth,Wyatt,,08/08/1999,male,14931 E Sharon,Kansas,Wichita,United States,67230,$1100000/$0,$30.98,
05/25/2018,Beacon America,863949,020,00072,ARS-02-0041365,201801192,,,,NEUFELD,ANGELIQUE,,07/09/2012,female,1643 S JACKSON PL,Washington,SEATTLE,United States,98144,$60000/$250,$6.15,
05/26/2018,Beacon International,863949,020,00072,ARS-01-0041364,201801191,,,,Zhang,Yuan,,07/21/1972,female,150 Alton Towers Cir Unit 611,Ontario,Scarborough,Canada,M1V4X7,$1100000/$100,$30.8,
05/24/2018,Beacon America,863949,020,00072,ARS-02-0041363,201801190,,,,schulman,adina,,03/28/2006,male,215 Howard,New Jersey,Passaic.com,United States,08701,$110000/$0,$8.75,
05/24/2018,Beacon America,863949,020,00072,ARS-02-0041362,201801189,,,,schulman,yitzchok,,02/05/2004,male,215 Howard,New Jersey,Passaic.com,United States,08701,$110000/$0,$8.75,
05/24/2018,Beacon America,863949,020,00072,ARS-02-0041361,201801188,,,,schulman,aliza,,08/02/2002,male,215 Howard,New Jersey,Passaic.com,United States,08701,$110000/$0,$8.75,
05/24/2018,Beacon America,863949,020,00072,ARS-02-0041360,201801187,,,,schulman,eliyahu,,11/19/1996,male,215 Howard,New Jersey,Passaic.com,United States,08701,$110000/$0,$9.63,
05/24/2018,Beacon America,863949,020,00072,ARS-02-0041359,201801186,,,,schulman,ahuva,,03/19/1965,male,215 Howard,New Jersey,Passaic.com,United States,08701,$110000/$0,$28.63,
05/24/2018,Beacon America,863949,020,00072,ARS-02-0041358,201801185,,,,schulman,avi,,11/09/1961,male,215 Howard,New Jersey,Passaic.com,United States,08701,$110000/$0,$28.63,
05/31/2018,Beacon International,863949,020,00072,ARS-01-0041357,201801184,,,,Gutierrez Bola&ntilde;os,Jochebed,,11/17/1992,female,Fracc Moderna,,Ensenada,Mexico,22860,$60000/$250,$9.12,
05/31/2018,Beacon International,863949,020,00072,ARS-01-0041356,201801182,,,,Novelo Ibarra,Marco,A,03/03/1994,male,Priv Marmol 150,,Ensenada,Mexico,22870,$60000/$250,$9.12,
05/24/2018,Beacon America,863949,020,00072,ARS-02-0041355,201801028,,,,sharma,shakun,,08/21/1994,female,1161 mountain view,ca,walnut creek,United States,94596,$60000/$1000,$36.7,
05/24/2018,Beacon America,863949,020,00072,ARS-02-0041354,201801027,Passport(p7672986),,,sharma,parveen,,09/25/1949,female,1161 mountain view,ca,walnut creek,United States,94596,$60000/$1000,$153.92,
05/26/2018,Beacon International,863949,020,00072,ARS-01-0041352,201800890,,,,Oqbu,Nazriet,M,01/01/1978,female,Ghindae,,Ghindae,Eritrea,700,$60000/$250,$16.5,
05/30/2018,OverseasCare Visitors Insurance Plan,863949,020,00072,OVI-28-0041347,201800885,Passport(K8357985),,,Sumangala,FNU,,01/01/1958,female,33 Briarwood Ln,Massachusetts,Marlborough,United States,01752,$60000/$250,$76.95,
05/30/2018,OverseasCare Visitors Insurance Plan,863949,020,00072,OVI-28-0041346,201800884,Passport(K8357985),,,Mallikarjun,FNU,,01/06/1955,male,33 Briarwood Ln,Massachusetts,Marlborough,United States,01752,$60000/$250,$76.95,
05/25/2018,Beacon International,863949,020,00072,ARS-01-0041345,201800883,Passport(507044391),,,MAJMUDAR,STUTI,,07/22/1986,female,13 MARINA KEY,New Jersey,SECAUCUS,United States,07094,$60000/$0,$16.88,
05/28/2018,Beacon International,863949,020,00072,ARS-01-0041340,201811282,,,,Tekeste,Essey,M,01/01/1988,male,Adi segdo,,Asmara,Eritrea,107,$60000/$250,$9,
05/28/2018,Beacon International,863949,020,00072,ARS-01-0041339,201833817,,,,Tekesete,Essey,M,01/01/1988,male,Adi Segdo,,Asmara,Eritrea,107,$60000/$250,$9,
05/28/2018,Beacon International,863949,020,00072,ARS-01-0041338,201863739,,,,Kesete,Essey,M,01/01/1988,female,Adi Segdo,,Asmara,Eritrea,107,$60000/$250,$9,
05/23/2018,Beacon America,863949,020,00072,ARS-02-0041314,201880897,,,,Klein ,Saindy,,05/13/1997,female,118 Division Ave,New York,Brooklyn,Canada,11211,$60000/$500,$69.19,
05/23/2018,Beacon International,863949,020,00072,ARS-01-0041283,201829311,,,,Waknin,Chana,,12/20/1972,female,37 Colesway,New Jersey,Lakewood,United States,08701,$2000000/$0,$29.8,
05/23/2018,Essential America,863949,020,00072,ARS-03-0041176,201810737,Passport(534847042),,,Blanshan,June,Marie,08/30/1964,female,7261 Arbol Dr NE,Michigan,Rockford,United States,49341,$5000000/$1000,$1675,
05/27/2018,Beacon International,863949,020,00072,ARS-01-0041282,201857795,,,,Han,Naeun,,04/14/1997,female,47 ravencliff cres,Ontario,Scarborough,Canada,M1T 1R7,$60000/$250,$7.6,
05/27/2018,Beacon International,863949,020,00072,ARS-01-0041281,201828159,,,,Yang,Jimin,,10/28/1990,female,47 ravencliff cres,Ontario,Scarborough,Canada,M1T 1R7,$60000/$250,$7.6,
05/27/2018,Beacon International,863949,020,00072,ARS-01-0041280,201819904,,,,Jeon,Jaejoon,,01/31/1978,male,47 ravencliff cres,Ontario,Scarborough,Canada,M1T 1R7,$60000/$250,$15,
05/27/2018,Beacon International,863949,020,00072,ARS-01-0041279,201826566,,,,Nam,Handong,,11/17/1987,male,47 ravencliff cres,Ontario,Scarborough,Canada,M1T 1R7,$60000/$250,$9,
05/27/2018,Beacon International,863949,020,00072,ARS-01-0041278,201872165,,,,Lee,Yangmoo,,10/11/1966,male,47 ravencliff cres,Ontario,Scarborough,Canada,M1T 1R7,$60000/$250,$26,
05/27/2018,Beacon International,863949,020,00072,ARS-01-0041277,201837320,,,,Cho,Kuem Ra,,12/15/1964,female,47 ravencliff cres,Ontario,Scarborough,Canada,M1T 1R7,$60000/$250,$26,
05/23/2018,Essential America,863949,020,00072,ARS-03-0041178,201824025,Passport(467700304),,,Swart,Tammy,Lyn,10/17/1963,female,1230 16th CT SW,Florida,Largo,United States,33770,$5000000/$5000,$1235,
05/27/2018,Beacon International,863949,020,00072,ARS-01-0041270,201836380,,,,Kim,Suh hee,,10/29/1992,female,47 ravencliff cres,Ontario,Scarborough,Canada,M1T 1R7,$60000/$250,$7.6,
05/27/2018,Beacon International,863949,020,00072,ARS-01-0041269,201854539,,,,Park,Hannah,,02/21/1991,female,47 ravencliff cres,Ontario,Scarborough,Canada,M1T 1R7,$60000/$250,$7.6,
05/27/2018,Beacon International,863949,020,00072,ARS-01-0041268,201812541,,,,Lee,Sangwoo,,08/30/1990,male,47 ravencliff cres,Ontario,Scarborough,Canada,M1T 1R7,$60000/$250,$7.6,
05/27/2018,Beacon International,863949,020,00072,ARS-01-0041267,201868466,,,,Bae,Jin seob,,07/14/1962,male,47 ravencliff cres,Ontario,Scarborough,Canada,M1T 1R7,$60000/$250,$26,
05/23/2018,Beacon International,863949,020,00072,ARS-01-0041260,201817111,,,,Mickus,Spencer,D,03/28/1998,male,9205 ASPEN CREEK PT,Colorado,Highlands Ranch,United States,80129,$60000/$500,$10.26,
05/23/2018,Beacon International,863949,020,00072,ARS-01-0041259,201877502,,,,Mickus,Jessalyn,A,05/23/2002,female,9205 ASPEN CREEK PT,Colorado,Highlands Ranch,United States,80129,$60000/$500,$9.45,
05/23/2018,Beacon International,863949,020,00072,ARS-01-0041258,201882152,,,,Mickus,Laina,L,05/17/1967,female,9205 ASPEN CREEK PT,Colorado,Highlands Ranch,United States,80129,$60000/$500,$35.1,
05/24/2018,Beacon America,863949,020,00072,ARS-02-0041255,201858423,Passport(126919619),,,GARCIA GORRIN,YOLIMAR ALEJANDRA ,,12/11/1985,female,2250 NW 114TH AVE,Florida,MIAMI,Venezuela,33172,$110000/$0,$23.4,
05/24/2018,Beacon America,863949,020,00072,ARS-02-0041254,201837114,,,,SALAZAR BELMONTE,ADRIANA LUCILA,,06/28/1975,female,2250 NW 114TH AVE,Florida,MIAMI,Venezuela,33172,$60000/$0,$27.56,
05/23/2018,Beacon America,863949,020,00072,ARS-02-0041253,201890386,Passport(P547535),,,pestana da silva,maria ,z,12/24/1950,female,2720 State st,Connecticut,Hamden,United States,06517,$1100000/$1000,$161.92,
05/25/2018,Beacon International,863949,020,00072,ARS-01-0041252,201899337,Passport(142582853),,,GUZMAN,DORIANNYS MARIANA,,12/26/1988,female,Av. La Paz calle 2 No 29 sector las avenidas,Monagas,Maturin,Venezuela,6201,$1100000/$100,$112.93,
05/23/2018,Clear America,863949,020,00072,ARS-05-0041075,201874684,Passport(TA355534),,,Tang,Jaimie,,06/15/1982,female,14 Fisher Ave.,00,00,Trinidad And Tobago,00,$2000000/$10000,$1028.7,
05/22/2018,Beacon International,863949,020,00072,ARS-01-0041249,201819545,,,,Breuer ,Chana ,,11/10/1954,female,125 Clinton Ave.,New York,New Square,United States,10977,$60000/$0,$40.63,
05/22/2018,Beacon America,863949,020,00072,ARS-02-0041243,201839624,,,,Sokamte,Adonis,,02/04/1956,male,900 Long Boulevard,Michigan,Lansing,United States,48906,$60000/$250,$139.5,
05/22/2018,Beacon International,863949,020,00072,ARS-01-0041241,201840446,,,,Weinberg,Avrohom,M,11/26/1991,male,1728 Brookhaven ave,New York,Far rockaway,United States,11691,$60000/$250,$13.68,
05/22/2018,Beacon International,863949,020,00072,ARS-01-0041240,201825273,,,,Craig,Glen,,11/07/1970,male,407 Old Town Court,Virginia,Alexandria,United States,22314,$550000/$250,$21.56,
05/22/2018,Beacon International,863949,020,00072,ARS-01-0041239,201894349,,,,Lindsey,Brian,,07/22/1971,male,407 Old Town Court,Virginia,Alexandria,United States,22314,$550000/$250,$21.56,
05/23/2018,Beacon America,863949,020,00072,ARS-02-0041236,201826425,Passport(AU747562),,,PARADA ACEROS,SANDRA MARCELA,,05/19/1963,female,CRA. 97 nO. 24 b 86 iNTERIOR 37 URBANIZACION LA CCOFRADIA manzana 44<,Distrito Capltal de Santa Fe de Bogot&atilde;,BOGOTA,Colombia,110911,$60000/$0,$198,
05/23/2018,Beacon International,863949,020,00072,ARS-01-0041235,201854440,,,,Sayers,Caroline,,04/23/1979,female,130 Malcolm X Blvd,New York,NYC,United States,10026,$60000/$250,$5.85,
05/25/2018,Beacon International,863949,020,00072,ARS-01-0041234,201857922,Passport(580767065),,,Poynter,Jazmyn,R,04/28/2000,female,117 Marcy Lane,Indiana,Greenwood,United States,46143,$110000/$0,$15.44,
05/28/2018,Beacon International,863949,020,00072,ARS-01-0041233,201808264,,,,Skrobynets,Marianna,Y,12/02/1997,female,10 AVE P,New York,BROOKLYN,United States,11204,$60000/$0,$6.65,
05/21/2018,Enhanced America,863949,020,00072,ARS-04-0041207,201824854,Passport(LH883888),,,Hersom,Aarron,,07/19/1979,male,108 tobie place,Waikato N,Whangamata,New Zealand,3620,$5000000/$500,$1794,
05/23/2018,Beacon America,863949,020,00072,ARS-02-0041228,201871058,,,,PARMAR,MAMTABAHEN,,05/06/1965,female,3300 Hudson Pl,California,Fremont,United States,94536,$60000/$2500,$337.68,
05/23/2018,Beacon America,863949,020,00072,ARS-02-0041227,201807716,Passport(H3934969),,,PARMAR,ASHOKKUMAR,,04/06/1952,male,3300 Hudson Pl,California,Fremont,United States,94536,$60000/$2500,$487.76,
05/23/2018,OverseasCare Visitors Insurance Plan,863949,020,00072,OVI-28-0041226,201823425,Passport(K6307501),,,Mehta,Neeta,Deepak,06/22/1964,female,220 Summit Blvd,Colorado,Broomfield,India,80021,$60000/$100,$79.56,
05/23/2018,OverseasCare Visitors Insurance Plan,863949,020,00072,OVI-28-0041225,201847807,Passport(K6307501),,,Mehta,Deepak,Manilal,07/21/1962,male,220 Summit Blvd,Colorado,Broomfield,India,80021,$60000/$100,$79.56,
05/21/2018,Beacon International,863949,020,00072,ARS-01-0041224,201805088,,,,Gonzalez,Jessica,M,10/22/1993,female,2374 Marlboro street,New York,East Meadow,United States,11554,$550000/$0,$25.03,
05/22/2018,OverseasCare Visitors Insurance Plan,863949,020,00072,OVI-28-0041223,201840977,Passport(H4881093),,,Arora,Mridula,,09/07/1957,female,70 sara dr,New Jersey,Robbinsville,United States,08691,$60000/$100,$297.04,
05/31/2018,Essential America,863949,020,00072,ARS-03-0041187,201886772,Passport(N06341711),,,Yermekbayev,Aidar,,06/17/1975,male,21634 Park Wick Ln,Texas,Katy,United States,77450,$5000000/$1000,$866,
05/31/2018,Essential America,863949,020,00072,ARS-03-0041187,201864442,,Passport(N08505995),Spouse,Yermekbayeva,Aliya,,11/02/1977,female,21634 Park Wick Ln,Texas,Katy,United States,77450,$5000000/$1000,$1818,
05/31/2018,Essential America,863949,020,00072,ARS-03-0041187,201899021,,Passport(N09346356),Dependant,Yermekbayev,Abylkhaiyr,,04/24/2003,male,21634 Park Wick Ln,Texas,Katy,United States,77450,$5000000/$1000,$442,
05/31/2018,Essential America,863949,020,00072,ARS-03-0041187,201893940,,Passport(N09346358),Dependant,Yermekbayev,Aubakir,,08/05/2006,male,21634 Park Wick Ln,Texas,Katy,United States,77450,$5000000/$1000,$442,
05/31/2018,Essential America,863949,020,00072,ARS-03-0041187,201831145,,Passport(N09996146),Dependant,Yermekbayev,Ansar,,03/28/2014,male,21634 Park Wick Ln,Texas,Katy,United States,77450,$5000000/$1000,$0,