Original Effective Date,Plan Type,Control,Suffix,Account,Policy Number,ID,EE SSN,Dependent SSN,Dependent Relationship,Last Name,First Name,Middle Initial,DOB,Gender,Address,State,City,Country,Postcode,Max/Ded,Premium,
07/07/2018,Beacon International,863949,020,00072,ARS-01-0042516,201827451,,,,Hecomovich,J,,05/02/1975,male,511 Hahaione St 2d,Hawaii,Honolulu,United States,96825,$550000/$250,$20.38,
07/07/2018,Beacon International,863949,020,00072,ARS-01-0042515,201827450,,,,Hecomovich,J,K,05/23/1975,male,511 Hahaione St 2d,Hawaii,Honolulu,United States,96825,$550000/$250,$15.68,
07/07/2018,Beacon International,863949,020,00072,ARS-01-0042514,201827449,,,,Walrath,Kathryn,M,09/18/1996,female,48 Rochelle Dr,New York,Churchville,United States,14428,$60000/$0,$254.6,
07/07/2018,Beacon International,863949,020,00072,ARS-01-0042512,201827447,,,,Anger,Pamela,J,09/27/1952,female,12929 N Marsh Dr,Florida,Port Charlotte,United States,33953,$110000/$250,$89.25,
07/07/2018,Beacon International,863949,020,00072,ARS-01-0042511,201827446,,,,Anager,Ralph,T,05/02/1952,male,12929 N Marsh Dr,Florida,Port Charlotte,United States,33953,$110000/$250,$89.25,
07/07/2018,OverseasCare Visitors Insurance Plan,863949,020,00072,OVI-28-0042510,201827445,Passport(N0498110),,,Komireddy,Jayaprada,,10/10/1950,female,4675 Stonehaven View,Georgia,cumming,United States,30040,$110000/$500,$364.32,
07/07/2018,Beacon International,863949,020,00072,ARS-01-0042502,201827436,,,,CALDERON MARTINEZ,ZHAYRI DEL VALLE,,09/15/1979,female,AVE. LOS LLANOS CONJUNTO RES VILLA DE ORO CASA 4,Barinas,BARINAS,Venezuela,00000,$1100000/$0,$39.68,
07/07/2018,Beacon International,863949,020,00072,ARS-01-0042501,201827436,Passport(104543687),,,GALICIA SANCHEZ,JOSE ,A,04/04/1981,male,AVE. LOS LLANOS CONJUNTO RES VILLA DE ORO CASA 4,Barinas,BARINAS,Venezuela,00000,$1100000/$0,$39.68,
07/07/2018,Beacon America,863949,020,00072,ARS-02-0042500,201827433,,,,Dai,Octavian,,11/12/2012,male,405-1598 Bathurst St.,Ontario,Toronto,Canada,M5P3H9,$60000/$0,$12.3,
07/07/2018,Beacon International,863949,020,00072,ARS-01-0042499,201827432,Passport(067838053),,,Gonzalez Pineda,Fernan Gabriel,,11/27/1996,male,Urb. Villas de Europa Casa Nro 28 las margaritas de Tariba,Tachira,Tariba,Venezuela,5017,$60000/$0,$35.15,
07/07/2018,Beacon International,863949,020,00072,ARS-01-0042486,201827368,,,,OTIS,BROOKE,A,04/04/2002,female,PO Box 10070,Indiana,MERRILLVILLE,United States,46411,$60000/$250,$7.02,
07/07/2018,Beacon International,863949,020,00072,ARS-01-0042485,201827367,,,,MEHOK,ISABELLA,A,05/02/2003,female,PO Box 10070,Indiana,MERRILLVILLE,United States,46411,$60000/$250,$7.02,
07/07/2018,Beacon International,863949,020,00072,ARS-01-0042484,201827366,,,,BOWDISH,ANNA,L,01/28/2000,female,PO Box 10070,Indiana,MERRILLVILLE,United States,46411,$60000/$250,$6.84,
07/07/2018,Beacon International,863949,020,00072,ARS-01-0042483,201827365,,,,CLARK,LOGAN,E,05/15/2002,male,PO Box 10070,Indiana,MERRILLVILLE,United States,46411,$60000/$250,$7.02,
07/07/2018,Beacon International,863949,020,00072,ARS-01-0042482,201827364,,,,GARZA MENDAK,MYAH,E,05/20/2003,male,PO Box 10070,Indiana,MERRILLVILLE,United States,46411,$60000/$250,$7.02,
07/07/2018,Beacon International,863949,020,00072,ARS-01-0042480,201826867,,,,HARVEY,KYLE,D,03/03/2003,male,PO Box 10070,Indiana,MERRILLVILLE,United States,46411,$60000/$250,$7.02,
07/07/2018,Beacon International,863949,020,00072,ARS-01-0042479,201826866,,,,ROWELL,COLE,W,03/31/2003,male,PO Box 10070,Indiana,MERRILLVILLE,United States,46411,$60000/$250,$7.02,
07/07/2018,Beacon International,863949,020,00072,ARS-01-0042478,201826820,,,,WINTERS,ZOE ,M,01/28/2000,female,PO Box 10070,Indiana,MERRILLVILLE,United States,46411,$60000/$250,$6.84,
07/07/2018,Beacon International,863949,020,00072,ARS-01-0042477,201826819,,,,READY,LANDIN,T,06/03/2003,male,PO Box 10070,Indiana,MERRILLVILLE,United States,46411,$60000/$250,$7.02,
07/07/2018,Beacon International,863949,020,00072,ARS-01-0042475,201826817,,,,ANOKWUTE,CHIAMARA,C,05/04/1997,female,PO Box 10070,Indiana,MERRILLVILLE,United States,46411,$60000/$250,$6.84,
07/07/2018,Beacon International,863949,020,00072,ARS-01-0042474,201826816,,,,READY,SUZANNE,L,02/25/1980,female,PO Box 10070,Indiana,MERRILLVILLE,United States,46411,$60000/$500,$7.29,
07/07/2018,Beacon International,863949,020,00072,ARS-01-0042471,201826707,,,,SHELLHAAS,LEIGHA,E,11/07/1988,female,303 West 80th Place,Indiana,MERRILLVILLE,United States,46410,$60000/$100,$7.52,
07/06/2018,Beacon America,863949,020,00072,ARS-02-0042464,201826528,,,,Sanghrajka,Tara,,11/18/1941,female,1520 Lake Baldwin Lane,Florida,Orlando,United States,32814,$50000/$250,$36,
07/06/2018,Beacon America,863949,020,00072,ARS-02-0042463,201826524,,,,Sanghrajka,Natwarlal,,03/08/1942,male,1520 Lake Baldwin Lane,Florida,Orlando,United States,32814,$50000/$250,$36,
07/06/2018,Beacon International,863949,020,00072,ARS-01-0042462,201826523,,,,Golinger,Amanda,,08/03/2002,female,7905 Parsons Pine Dr,Florida,Boynton Beach,United States,33437,$550000/$250,$5.5,
07/06/2018,Beacon America,863949,020,00072,ARS-02-0042461,201826522,,,,Richard,Michele,,10/16/1987,female,1863 Orchard Drive,British Columbia,Kamloops,Canada,v2c4h3,$1100000/$250,$75.5,
07/06/2018,Beacon International,863949,020,00072,ARS-01-0042460,201825531,,,,Pinilla Buitrago,Gonzalo,E,09/08/1988,male,281 Edgecombe Ave. Apt 8f,New York,New York,United States,10031,$60000/$0,$21.85,
07/07/2018,Beacon America,863949,020,00072,ARS-02-0042451,201825512,,,,Gao,Frank,,06/02/2009,male,7-202 Renhengbandao Xiangzhou Dist.,,Zhuhai,China,519000,$110000/$100,$50.82,
07/07/2018,Beacon America,863949,020,00072,ARS-02-0042450,201825508,,,,jiang,xin,,11/14/1977,female,7-202 Renhengbandao Xiangzhou Dist.,,Zhuhai,China,519000,$110000/$100,$108.17,
07/07/2018,Beacon America,863949,020,00072,ARS-02-0042448,201825506,,,,RAMIREZ,VALERIA ,,02/10/2011,female,AV PRINCIPAL DE PUEBLO NUEVO URB DONA EMILIA SECTOR BUENOS AIRES CASA 2,Tachira,SAN CRISTOBAL,Venezuela,5001,$60000/$0,$41.69,
07/07/2018,Beacon America,863949,020,00072,ARS-02-0042447,201825505,,,,RAMIREZ,DIANA,,10/10/2007,female,AV PRINCIPAL DE PUEBLO NUEVO URB DONA EMILIA SECTOR BUENOS AIRES CASA 2,Tachira,SAN CRISTOBAL,Venezuela,5001,$60000/$0,$41.69,
07/07/2018,Beacon America,863949,020,00072,ARS-02-0042446,201825504,,,,QUIJADA ,NADIA MARLINE ,,07/11/1979,female,AV PRINCIPAL DE PUEBLO NUEVO URB DONA EMILIA SECTOR BUENOS AIRES CASA 2,Tachira,SAN CRISTOBAL,Venezuela,5001,$60000/$0,$59.45,
07/07/2018,Beacon America,863949,020,00072,ARS-02-0042445,201825503,Passport(136080646),,,RAMIREZ NARVAEZ,ANDRES ALBERTO ,,07/06/1976,male,AV PRINCIPAL DE PUEBLO NUEVO URB DONA EMILIA SECTOR BUENOS AIRES CASA 2,Tachira,SAN CRISTOBAL,Venezuela,5001,$60000/$0,$88.81,
07/06/2018,OverseasCare Visitors Insurance Plan,863949,020,00072,OVI-28-0042444,201825502,,,,li,lihua,,04/11/1967,female,400 W 63rd St APT912,New York,NEW YORK,United States,10069,$110000/$100,$10,
07/06/2018,OverseasCare Visitors Insurance Plan,863949,020,00072,OVI-28-0042443,201825501,,,,zhan,yao huang,,08/05/1961,male,400 W 63rd St APT912,New York,NEW YORK,United States,10069,$110000/$100,$10,
07/06/2018,Beacon America,863949,020,00072,ARS-02-0042436,201825454,Passport(H5179191),,,Parameswaran Chettiar,Kathirvel,,11/20/1948,male,53 Shaniko Cmn,California,FREMONT,United States,94539,$110000/$0,$212.5,
07/05/2018,OverseasCare Visitors Insurance Plan,863949,020,00072,OVI-28-0042434,201825451,,,,Gera,Archana,,12/04/1964,female,81 Magnolia Dr,Illinois,Streamwood,United States,60107,$110000/$250,$36.4,
07/05/2018,Beacon International,863949,020,00072,ARS-01-0042431,201825393,,,,Cohen,Alan,,04/04/1963,male,2740 COVERED BRIDGE ROAD,New York,Merrick,United States,11566,$2000000/$500,$33.26,
07/05/2018,Beacon International,863949,020,00072,ARS-01-0042430,201825392,Passport(541993380),,,COHEN,RACHEL,M,09/14/1964,female,2740 COVERED BRIDGE ROAD,New York,Merrick,United States,11566,$2000000/$500,$33.26,
07/06/2018,Beacon America,863949,020,00072,ARS-02-0039649,201825271,Passport(K0670545),,,ALLADA,SURYAKANTAM,,12/16/1945,female,699 John St,Washington,Seattle,United States,98109,$50000/$100,$3136.32,
07/05/2018,Beacon International,863949,020,00072,ARS-01-0042428,201825270,,,,Torres,Nellie,,11/02/1955,female,100 W. 57th St - Apt. 12K,New York,New York,United States,10019,$110000/$0,$126,
07/05/2018,Beacon International,863949,020,00072,ARS-01-0042424,201825266,,,,Urenda,Zachary,J,07/04/1993,male,1100 Wilshire Blvd APT 1906,California,Los Angeles,United States,90017,$60000/$250,$90.44,
07/05/2018,Beacon America,863949,020,00072,ARS-02-0042423,201825265,,,,Dueck,Momoka,E,01/16/2016,female,8429 S.112th St.,Washington,Seattle,United States,98178,$110000/$250,$9.1,
07/05/2018,Beacon America,863949,020,00072,ARS-02-0042422,201825264,,,,Dueck,Hiromi,A,06/01/1980,female,8429 S.112th St.,Washington,Seattle,United States,98178,$110000/$250,$13.52,
07/05/2018,Beacon America,863949,020,00072,ARS-02-0042421,201825263,,,,Dueck,Jeffrey,P,01/31/1977,male,8429 S.112th St.,Washington,Seattle,United States,98178,$110000/$250,$19.37,
07/06/2018,Beacon America,863949,020,00072,ARS-02-0042420,201825262,Passport(AP053497),,,Ramirez,Fabio,A,08/24/1988,male,Mesc631@hotmail.com,Distrito Capltal de Santa Fe de Bogot&atilde;,Bogota,Colombia,111166,$550000/$0,$256.15,
07/04/2018,Beacon International,863949,020,00072,ARS-01-0042417,201825259,,,,Narain,Monica,,01/17/1975,female,4335 Sundance Cir,Georgia,Cumming,United States,30028,$60000/$250,$16.5,
07/04/2018,Beacon International,863949,020,00072,ARS-01-0042416,201825258,,,,Weatherly,Tracy,,06/15/1979,female,4335 Sundance Cir,Georgia,Cumming,United States,30028,$60000/$250,$9.9,
07/04/2018,Beacon International,863949,020,00072,ARS-01-0042415,201825257,,,,McDermid,Sabrina,,03/14/1978,female,4335 Sundance Cir,Georgia,Cumming,United States,30028,$60000/$250,$16.5,
07/04/2018,Beacon International,863949,020,00072,ARS-01-0042414,201825256,,,,Mount,Tori,,02/24/1977,female,4335 Sundance Cir,Georgia,Cumming,United States,30028,$60000/$250,$16.5,
07/04/2018,Beacon International,863949,020,00072,ARS-01-0042413,201825257,,,,Ravenel,Cailyn,,06/06/2006,female,4335 Sundance Cir,Georgia,Cumming,United States,30028,$60000/$250,$7.7,
07/04/2018,Beacon International,863949,020,00072,ARS-01-0042412,201825253,,,,Dixon,Susan,,11/29/1979,female,4335 Sundance Cir,Georgia,Cumming,United States,30028,$60000/$250,$9.9,
07/04/2018,Beacon International,863949,020,00072,ARS-01-0042411,201825252,,,,Mills,Hillary,B,06/16/1982,female,65-02 68th avenue,New York,Ridgewood,United States,11385,$60000/$100,$14.85,
07/04/2018,Beacon International,863949,020,00072,ARS-01-0042410,201825251,,,,Brownstein,Matthew,K,03/04/1985,male,65-02 68th avenue,New York,Ridgewood,United States,11385,$60000/$100,$14.85,
07/04/2018,Beacon International,863949,020,00072,ARS-01-0042409,201825250,,,,Brownstein,Felix,B,05/27/2016,male,65-02 68th avenue,New York,Ridgewood,United States,11385,$60000/$100,$11.55,
07/04/2018,Beacon International,863949,020,00072,ARS-01-0042408,201825249,,,,Grossman,malka,,08/31/2003,female,1160 47th St,New York,Brooklyn,United States,11219,$60000/$0,$45.83,
07/07/2018,Beacon International,863949,020,00072,ARS-01-0042407,201825248,,,,Golner,Jonathan,E,12/18/1973,male,1805 N. Quesada St,Virginia,Arlington,United States,22205,$60000/$250,$7.5,
07/07/2018,Beacon International,863949,020,00072,ARS-01-0042406,201825247,,,,Bass,Bianca,L,10/13/1968,female,1805 N. Quesada St,Virginia,Arlington,United States,22205,$60000/$250,$7.5,
07/07/2018,Beacon International,863949,020,00072,ARS-01-0042404,201825245,Passport(TB688714),,,Guevara,Wayne,,01/26/1955,male,Kenny Street,TT,Sangre Grande,Trinidad And Tobago,99999,$60000/$0,$44.69,
07/07/2018,Beacon International,863949,020,00072,ARS-01-0042403,201825244,Passport(TB442436),,,Lalla,Lydia,,04/26/1987,female,20 Ameerali Ave,TT,ARIMA,Trinidad And Tobago,99999,$60000/$0,$12.38,
07/07/2018,Beacon International,863949,020,00072,ARS-01-0042402,201824990,Passport(TB217054),,,Salina,Elspeth,A,01/07/1964,female,20 Ameerali Ave,TT,ARIMA,Trinidad And Tobago,99999,$60000/$0,$35.75,
07/04/2018,Beacon America,863949,020,00072,ARS-02-0042400,201824988,,,,Shivkumar,Monica,,02/02/1991,female,No 6 Simpang 480,,Bandar Seri Begawan,,BC4115,$60000/$250,$226.92,
07/04/2018,Beacon International,863949,020,00072,ARS-01-0042399,201824987,,,,MAHIDA,MAXWELL,B,06/09/2017,male,5 STRATFORD ROAD,New York,BROOKLYN,United States,11218,$550000/$250,$12,
07/04/2018,Beacon International,863949,020,00072,ARS-01-0042398,201824986,,,,MAHIDA,SONAL,M,03/17/1978,female,5 STRATFORD ROAD,New York,BROOKLYN,United States,11218,$550000/$250,$23.52,
07/06/2018,Beacon International,863949,020,00072,ARS-01-0042397,201824985,Passport(463343635),,,Larsen,Tessa ,J,12/24/1991,female,2434 N California Ave,Illinois,Chicago,United States,60647,$1100000/$0,$16.23,
07/04/2018,Beacon International,863949,020,00072,ARS-01-0042394,201824982,,,,Hasson,Evie,,09/26/2017,female,304-120 Milross Avenue,British Columbia,Vancouver,Canada,V6A4k7,$60000/$250,$16.1,
07/04/2018,Beacon International,863949,020,00072,ARS-01-0042393,201824981,,,,Tierney,Maria,,11/29/1985,female,304-120 Milross Avenue,British Columbia,Vancouver,Canada,V6A4k7,$60000/$250,$20.7,
07/04/2018,Beacon International,863949,020,00072,ARS-01-0042392,201824980,,,,Hasson,Ryan,,03/03/1985,male,304-120 Milross Avenue,British Columbia,Vancouver,Canada,V6A4k7,$60000/$250,$20.7,
07/03/2018,Beacon America,863949,020,00072,ARS-02-0042390,201824978,,,,Konrath,Catherine,E,11/07/1990,female,6 Highfield Oval,,Harpenden,United Kingdom,Herts,$1100000/$0,$44.63,
07/03/2018,Beacon America,863949,020,00072,ARS-02-0042389,201824493,Passport(N064808),,,GARCIA PESTANA,MARISOL ,A,08/24/1970,female,2720 STATE ST APT 31,Connecticut,HAMDEN,United States,06517,$1100000/$1000,$282.88,
07/07/2018,Beacon International,863949,020,00072,ARS-01-0042388,201824490,Passport(468845387),,,Jackson,Teri,L,08/26/1959,female,17451 Bastanchury Road Suite 203,California,Yorba Linda,United States,92886,$1100000/$250,$106.76,
07/03/2018,Beacon International,863949,020,00072,ARS-01-0042387,201824489,,,,Maskin,Ilana,,11/09/1980,female,303 east 37th street,New York,new york,United States,10016,$1100000/$0,$10.35,
07/03/2018,Beacon International,863949,020,00072,ARS-01-0042383,201824474,,,,Friedman,Joseph,,02/24/1975,male,4 Plymouth Pl,New York,Airmont,United States,10952,$110000/$0,$11.25,
07/04/2018,Beacon America,863949,020,00072,ARS-02-0042374,201823700,,,,Kocsis,Kamilla,,11/07/1999,female,1361 Maple Terrace,New Jersey,Rahway,United States,07065,$110000/$100,$47.43,
07/05/2018,Beacon International,863949,020,00072,ARS-01-0042373,201823699,,,,Raibley,Luca,Lawrence,08/08/2012,male,505 Storke Rd,California,Goleta,United States,93117,$60000/$0,$41.13,
07/05/2018,Beacon International,863949,020,00072,ARS-01-0042372,201823698,,,,Raibley,Raphael,,01/05/2010,male,505 Storke Rd,California,Goleta,United States,93117,$60000/$0,$41.13,
07/05/2018,Beacon International,863949,020,00072,ARS-01-0042371,201823697,,,,Werth,Silke,,01/29/1982,female,505 Storke Rd,California,Goleta,United States,93117,$60000/$0,$52.88,
07/02/2018,Beacon International,863949,020,00072,ARS-01-0042369,201823695,,,,Zhang,Isabella,J,08/04/1999,female,Apt. 9 3065 Dayanee Springs Blvd.,British Columbia,Coquitlam,Canada,V3E 0A5,$60000/$0,$6.65,
07/02/2018,Beacon International,863949,020,00072,ARS-01-0042368,201823664,,,,SCHISCHA,JOCELYNE,,07/11/1945,female,213 Hooper Street,New York,brooklyn,United States,11211,$50000/$250,$28.75,
07/02/2018,Beacon International,863949,020,00072,ARS-01-0042367,201823661,,,,Kearford,Alvar Elias,,12/03/2008,male,470 2nd St,New York,Brooklyn,United States,11215,$60000/$0,$12.68,
07/03/2018,Beacon International,863949,020,00072,ARS-01-0042365,201823657,,,,Unamuno Vitale,Martina,E,02/01/1956,female,6470 Main Street,Florida,Miami Lakes,Spain,33014,$60000/$100,$71.5,
07/03/2018,Beacon International,863949,020,00072,ARS-01-0042364,201823657,Passport(114452407),,,Rodriguez Marti,Jorge,L,01/31/1951,male,6470 Main Street,Florida,Miami Lakes,Spain,33014,$60000/$100,$85.36,
07/02/2018,Beacon International,863949,020,00072,ARS-01-0042354,201823634,,,,Doboze,Kimberly,,07/05/1954,female,431 Bella Luna Lane,Florida,New Smyrna Beach,United States,32168,$550000/$500,$46.04,
07/02/2018,Beacon International,863949,020,00072,ARS-01-0042350,201823628,,,,Michael,Julie,L,08/04/1985,female,213 W. 252 St,New York,Bronx,United States,10471,$60000/$250,$4.5,
07/02/2018,Beacon International,863949,020,00072,ARS-01-0042349,201823627,,,,Godard,Daniel,L,10/07/1983,male,213 W. 252 St,New York,Bronx,United States,10471,$60000/$250,$4.5,
07/02/2018,Beacon International,863949,020,00072,ARS-01-0042348,201823626,,,,Duteil,Hombeline,M,12/10/2003,female,1356 Madison Avenue,New York,New York,United States,10128,$60000/$0,$31.2,
07/03/2018,Beacon America,863949,020,00072,ARS-02-0042331,201823606,,,,O&apos;Brien,Bryan,,08/11/1956,male,Madonna House,Ontario,Combermere,Canada,K0J1L0,$60000/$250,$22.5,
07/01/2018,Beacon America,863949,020,00072,ARS-02-0042329,201823604,,,,Scherman,Trudy,O,11/14/1974,female,Casa 36E,,San Pablo de Heredia,Costa Rica,00000,$60000/$250,$24.5,
07/01/2018,Beacon International,863949,020,00072,ARS-01-0042328,201823601,,,,Juarez,Abraham,,08/30/1977,male,601 Sandia Vista Ct,New Mexico,Rio Rancho,United States,87124,$60000/$100,$26.4,
07/04/2018,OverseasCare Visitors Insurance Plan,863949,020,00072,OVI-28-0042326,201823599,Passport(K7639692),,,Sodhani,Prabha,,02/11/1950,female,5401 Calverton Dr,North Carolina,Raleigh,United States,27613,$110000/$500,$221.76,
07/04/2018,OverseasCare Visitors Insurance Plan,863949,020,00072,OVI-28-0042325,201823598,Passport(K7639692),,,Sodhani,Govind,D,02/08/1944,male,5401 Calverton Dr,North Carolina,Raleigh,United States,27613,$110000/$500,$262.08,
06/30/2018,Beacon International,863949,020,00072,ARS-01-0042324,201823597,,,,Kudo,Anastasia,,09/23/2009,female,6709 117th Ave NE,,Kirkland,United States,98033,$550000/$1000,$8.8,
06/30/2018,Beacon International,863949,020,00072,ARS-01-0042323,201823596,,,,Pitarys,Laura,,06/26/1978,female,6709 117th Ave NE,,Kirkland,United States,98033,$550000/$1000,$17.25,
07/02/2018,Beacon International,863949,020,00072,ARS-01-0042320,201823492,,,,werner,christine,l,08/23/1956,male,183 promomtory,California,newport beach,United States,92660,$1100000/$2500,$172.9,
07/02/2018,Beacon International,863949,020,00072,ARS-01-0042319,201823491,Passport(586160398),,,werner,philip,h,02/19/1949,male,183 promomtory,California,newport beach,United States,92660,$1100000/$2500,$185.64,
07/07/2018,Beacon International,863949,020,00072,ARS-01-0042318,201823480,,,,Clarke,Kennard,,06/21/1982,male,2425 Wlison Blvd,Virginia,Arlington,United States,22201,$60000/$0,$9,
07/07/2018,Beacon International,863949,020,00072,ARS-01-0042317,201823479,,,,Sanchez,Abimael,,09/06/1974,male,2425 Wlison Blvd,Virginia,Arlington,United States,22201,$60000/$0,$15,
07/07/2018,Beacon International,863949,020,00072,ARS-01-0042316,201823478,,,,Noralez,Crystal,,10/01/1991,female,2425 Wlison Blvd,Virginia,Arlington,United States,22201,$60000/$0,$7.6,
07/07/2018,Beacon International,863949,020,00072,ARS-01-0042315,201823477,,,,Enwright,Kirk,,04/18/1989,male,2425 Wlison Blvd,Virginia,Arlington,United States,22201,$60000/$0,$7.6,
07/01/2018,Beacon International,863949,020,00072,ARS-01-0032803,201823291,Passport(486198458),,,SCOTT,DONALD ,,09/29/1980,male,22 Bittersweet Lane,New York,Glen Cove,United States,11542,$2000000/$100,$215.82,
07/01/2018,Beacon America,863949,020,00072,ARS-02-0038881,201823290,Passport(E38673167),,,Liu,Jia,,03/12/1982,female,1216 South Charlestown Street,Washington,Seattle,United States,98108,$550000/$100,$261.1,
06/30/2018,Beacon International,863949,020,00072,ARS-01-0042308,201823089,,,,Brewer,Kaleb,,12/23/1997,male,3535 Homedale Rd,Oregon,Klamath Falls,United States,97603,$550000/$0,$55,
07/01/2018,Beacon America,863949,020,00072,ARS-02-0042305,201823085,Passport(AO540625),,,Malagon,Andrea,,02/14/1979,female,Calle 117D#58-50,Cundinamarca,Bogota,Colombia,0000,$550000/$0,$132.23,
07/01/2018,Beacon America,863949,020,00072,ARS-02-0042301,201823059,,,,BONILLA GOMEZ,IRENE,,11/27/2006,female,ANGEL 16,Alicante,ELCHE,Spain,03203,$550000/$0,$65.25,
07/01/2018,Beacon America,863949,020,00072,ARS-02-0042300,201823058,,,,ESCODA MARRUGAT,ALEX,,05/09/2004,male,ANGEL 16,Alicante,ELCHE,Spain,03203,$550000/$0,$65.25,
07/01/2018,Beacon America,863949,020,00072,ARS-02-0042299,201823059,,,,garcia miralles,odei,,09/02/2004,male,ANGEL 16,Alicante,ELCHE,Spain,03203,$550000/$0,$65.25,
07/01/2018,Beacon America,863949,020,00072,ARS-02-0042298,201823055,Passport(PAC593371),,,fons torres,magdalena,,10/28/2002,female,ANGEL 16,Alicante,ELCHE,Spain,03203,$550000/$0,$65.25,
07/01/2018,Beacon International,863949,020,00072,ARS-01-0042297,201823054,,,,hogan,padraig,,04/01/1980,male,via argentina,,panama,Panama,N/A,$60000/$250,$30.42,
07/03/2018,Beacon International,863949,020,00072,ARS-01-0042289,201823043,Passport(22732124),,,Ruppin,Eytan,,07/18/1956,male,11022 Marcliff Road,District of Columbia,Rockville,United States,20852,$60000/$0,$89.38,
07/03/2018,Beacon International,863949,020,00072,ARS-01-0042286,201823040,,,,Ruppin,Ori,,09/14/2002,male,11022 Marcliff Road,District of Columbia,N Bethesda,United States,20852,$60000/$0,$28.88,
07/03/2018,Beacon International,863949,020,00072,ARS-01-0042285,201823039,Passport(546835946),,,GalRuppin,Naomi,,03/28/1967,female,11022 Marcliff Road,District of Columbia,N Bethesda,United States,20852,$60000/$0,$107.25,
07/06/2018,Beacon International,863949,020,00072,ARS-01-0042279,201823031,Passport(546820708),,,Manginis,Richard,,03/25/1998,male,256 Larch Row,Massachusetts,Wenham,United States,01984,$2000000/$250,$187.62,
06/30/2018,Beacon International,863949,020,00072,ARS-01-0040208,201888053,,,,Bell,Stacy,,12/16/1983,female,836 Halsey Street,New York,Brooklyn,United States,11233,$60000/$250,$54.9,
07/01/2018,Beacon International,863949,020,00072,ARS-01-0042247,201822995,Passport(800958884),,,Dala Ali,Benan,,05/27/1981,male,405 St Johns Church,Pennsylvania,Camp Hill,United States,17011,$1100000/$0,$25.88,
07/02/2018,Beacon America,863949,020,00072,ARS-02-0042241,201822659,,,,segal,shoshana,,05/29/1976,female,78 cabinfield circle,,lakewood,United States,08701,$1100000/$0,$55.25,
07/02/2018,Beacon America,863949,020,00072,ARS-02-0042240,201822659,,,,segal,aaron,,06/12/1975,male,78 cabinfield circle,,lakewood,United States,08701,$1100000/$0,$55.25,
07/01/2018,Beacon America,863949,020,00072,ARS-02-0042237,201821790,,,,Boado,Michael David,D,11/19/1960,male,2631 N Skyline Drive,Indiana,Bloomington,United States,47404,$60000/$1000,$357.12,
07/04/2018,Essential America,863949,020,00072,ARS-03-0042182,201819933,Passport(581787460),,,Diehl,Brian,Scott,04/18/1987,male,2 Mount Muiz 6 Holland Road,Western Cape,Muizenberg,South Africa,9750,$5000000/$1000,$758,
07/04/2018,Essential America,863949,020,00072,ARS-03-0042182,201819935,,Passport(581787462),Spouse,Diehl,Ashley,Lynne,03/03/1988,female,2 Mount Muiz 6 Holland Road,Western Cape,Muizenberg,South Africa,9750,$5000000/$1000,$1250,
07/04/2018,Essential America,863949,020,00072,ARS-03-0042182,201819938,,Passport(584652164),Dependant,Diehl,Obadiah,Paul,01/08/2013,male,2 Mount Muiz 6 Holland Road,Western Cape,Muizenberg,South Africa,9750,$5000000/$1000,$0,
07/04/2018,Essential America,863949,020,00072,ARS-03-0042182,201819942,,Passport(584652165),Dependant,Diehl,Noelle,Michaela,05/13/2014,female,2 Mount Muiz 6 Holland Road,Western Cape,Muizenberg,South Africa,9750,$5000000/$1000,$0,
06/30/2018,Beacon America,863949,020,00072,ARS-02-0042230,201821381,,,,SALOM,MARIA FABIANA,,02/27/2013,female,1000 WALDEN CREEK TRACE,Tennessee,SPRIN HILL,Venezuela,37174,$60000/$100,$78.43,