Original Effective Date,Plan Type,Control,Suffix,Account,Policy Number,ID,EE SSN,Dependent SSN,Dependent Relationship,Last Name,First Name,Middle Initial,DOB,Gender,Address,State,City,Country,Postcode,Max/Ded,Premium,
06/29/2018,Beacon International,863949,020,00072,ARS-01-0042313,201823295,Passport(5509566662),,,Bradley ,Coranetta ,,01/13/1969,male,3343 Tewson Dr,Georgia,Columbus,United States,31909,$1100000/$0,$25,
06/29/2018,Beacon International,863949,020,00072,ARS-01-0042307,201823088,,,,Peh,Eugene,,07/30/1980,male,1003 LINDEN ST,Texas,Austin,United States,78702,$550000/$100,$13.37,
06/28/2018,Beacon America,863949,020,00072,ARS-02-0042306,201823086,,,,Basques,Henrique,,11/09/2002,male,Av Senador Vergueiro 3290 - apto,,Bairro Anchueta,Brazil,09600-004,$60000/$250,$43.05,
06/29/2018,OverseasCare Visitors Insurance Plan,863949,020,00072,OVI-28-0042304,201823068,,,,Parekh,Bina Prahlad,,08/01/1966,female,2107 capitol park ct,California,san jose,United States,95132,$60000/$100,$210.6,
06/28/2018,Essential America,863949,020,00072,ARS-03-0042242,201822832,Passport(YC663995),,,KLEMM,EDGARD,LEO,05/02/1983,male,9745 ARBOR OAKS LANE APTO.302,Florida,BOCA RATON,United States,33428,$5000000/$500,$1031,
06/28/2018,Essential America,863949,020,00072,ARS-03-0042242,201822834,,Passport(FM619613),Spouse,FERREIRA CASTELLANI,ELLEN,REGINA,01/06/1983,female,9745 ARBOR OAKS LANE APTO.302,Florida,BOCA RATON,United States,33428,$5000000/$500,$1795,
06/28/2018,Essential America,863949,020,00072,ARS-03-0042242,201822837,,Passport(YC665012),Dependant,CASTELLANI KLEMM,EDUARDO,,12/07/2016,male,9745 ARBOR OAKS LANE APTO.302,Florida,BOCA RATON,United States,33428,$5000000/$500,$0,
06/28/2018,Beacon America,863949,020,00072,ARS-02-0042278,201823028,,,,Mujumdar,Saroj,S,07/20/1967,female,3131 Watkins Drive,,Riverside,India,92507,$60000/$250,$64.8,
06/28/2018,Beacon International,863949,020,00072,ARS-01-0042269,201823019,,,,JUCKEM,KYLE,H,11/18/1988,male,179 Valencia Circle,Florida,St. Petersburg,United States,33716,$110000/$250,$9.5,
06/28/2018,Beacon International,863949,020,00072,ARS-01-0042259,201823009,,,,Petway,Debra,A,12/11/1959,female,501 New Hope Rd,Texas,McKinney,United States,75071,$60000/$250,$23.4,
06/28/2018,Beacon International,863949,020,00072,ARS-01-0042258,201823008,,,,Petway,Johnny,D,09/25/1951,male,501 New Hope Rd,Texas,McKinney,United States,75071,$60000/$250,$34.92,
06/28/2018,Beacon International,863949,020,00072,ARS-01-0042256,201823006,,,,GARCIA,ULISES,,09/09/1979,male,GUADALAJARA 203,,Jalapa,Mexico,91130,$60000/$250,$13.5,
06/28/2018,Beacon America,863949,020,00072,ARS-02-0042212,201819985,Passport(207753245),,,Quan Chan,Flora,Tiffany,10/18/1991,female,15 Park Bl,Virginia,Staunton,United States,24401,$550000/$100,$304.55,
06/29/2018,Beacon America,863949,020,00072,ARS-02-0042203,201819973,Passport(H8906565),,,Jain,Chandanbala,,11/05/1962,female,921 Catamaran Street,California,Foster City,United States,94404,$1100000/$2500,$459.55,
06/26/2018,Beacon International,863949,020,00072,ARS-01-0042202,201819972,,,,Kubali,Selin,,04/06/2001,female,314 West 94th Street 6E,New York,New York,United States,10025,$60000/$250,$9.1,
06/26/2018,Beacon International,863949,020,00072,ARS-01-0042201,201819971,,,,Kubali,Kimberly,,07/02/1968,female,314 West 94th Street 6E,New York,New York,United States,10025,$60000/$250,$19.5,
06/26/2018,Beacon International,863949,020,00072,ARS-01-0042200,201819969,,,,Cordileone,Salvatore,J,06/05/1956,male,1 Peter Yorke Way,California,San Francisco,United States,94109,$550000/$250,$69.75,
06/26/2018,Beacon International,863949,020,00072,ARS-01-0042187,201819947,,,,Schwab,Cole,J,03/03/2016,male,1815 Oregon st,California,Berkeley,United States,94703,$60000/$250,$23.1,
06/26/2018,Beacon International,863949,020,00072,ARS-01-0042186,201819946,,,,Rajala,Annemaria,,03/08/1979,female,1815 Oregon st,California,Berkeley,United States,94703,$60000/$250,$29.7,
06/26/2018,Beacon America,863949,020,00072,ARS-02-0042185,201819945,Passport(H3662902),,,Bobde,Shobha,,06/08/1948,female,270 STRATFORD PL,CA,LOS ALTOS,United States,94022,$50000/$250,$446.4,
06/26/2018,Beacon America,863949,020,00072,ARS-02-0042183,201819943,Passport(H3662906 11),,,Bobde,Prakash,,11/13/1941,male,516 VanBuren Street,CA,LOS ALTOS,United States,94022,$50000/$250,$446.4,
06/26/2018,Beacon International,863949,020,00072,ARS-01-0042181,201819932,,,,Muser,Basya,,07/23/1996,female,170 KEARSING PKWY,New York,MONSEY,United States,10952,$550000/$0,$13.75,
06/26/2018,Beacon International,863949,020,00072,ARS-01-0042180,201819931,,,,Muser,Tzvi,,08/31/1992,male,170 KEARSING PKWY,New York,MONSEY,United States,10952,$550000/$0,$13.75,
06/26/2018,Beacon International,863949,020,00072,ARS-01-0042179,201819894,,,,Mahoney,NIcole,,01/25/1988,female,4510 STANFORD AVE NE,Washington,SEATTLE,United States,98105,$60000/$250,$16.2,
06/26/2018,Beacon International,863949,020,00072,ARS-01-0042178,201819893,,,,Mahoney,Ligia,,09/25/1963,female,4510 STANFORD AVE NE,Washington,SEATTLE,United States,98105,$60000/$250,$46.8,
06/26/2018,Enhanced America,863949,020,00072,ARS-04-0042098,201818806,Passport(KD841769),,,Silva,Karin,B,05/14/1969,female,Nigvaddo Saligao,Goa,Bardez,India,403511,$5000000/$1000,$2714,
06/26/2018,Beacon International,863949,020,00072,ARS-01-0042176,201819869,,,,capoor,preeti,,11/26/1966,female,938 blyleven blvd,Ontario,mississauga,Canada,l5v2g5,$60000/$500,$25.74,
06/26/2018,Beacon International,863949,020,00072,ARS-01-0042175,201819868,Passport(hk865405),,,masrani,rajesh,,05/20/1959,male,938 blyleven blvd,Ontario,mississauga,Canada,l5v2g5,$60000/$500,$25.74,
06/26/2018,Beacon International,863949,020,00072,ARS-01-0042173,201819745,,,,yosopovici,Erez,G,09/17/2006,male,257 west 86th street,New York,NEW YORK CITY,United States,10024,$1100000/$250,$17.6,
06/26/2018,Beacon International,863949,020,00072,ARS-01-0042172,201819744,,,,yosopovici,Hilary,i,12/21/1965,female,257 west 86th street,New York,NEW YORK CITY,United States,10024,$1100000/$250,$50.24,
06/25/2018,Essential International,863949,020,00072,ARS-03-0041731,201809118,Passport(483701301),,,Howard,James,Reginald,10/09/1958,male,Section 30 Lot 5,East Sepik Province,Wewak,Papua new Guinea,531,$5000000/$1000,$1381,
06/25/2018,Essential International,863949,020,00072,ARS-03-0041731,201809120,,Passport(E168554),Spouse,Howard,Susan,,07/16/1968,female,Section 30 Lot 5,East Sepik Province,Wewak,Papua new Guinea,531,$5000000/$1000,$1227.05,
06/25/2018,Essential International,863949,020,00072,ARS-03-0041731,201809123,,Passport(E174789),Dependant,Howard,Jimmy,Joseph,10/10/2001,male,Section 30 Lot 5,East Sepik Province,Wewak,Papua new Guinea,531,$5000000/$1000,$333,
06/20/2018,Essential International,863949,020,00072,ARS-03-0042000,201815702,Passport(531762360),,,Howard,James,Reginald,10/09/1958,male,Section 30 Lot 5,,East Sepik Prov,Guinea,531,$5000000/$1000,$1381,
06/20/2018,Essential International,863949,020,00072,ARS-03-0042000,201815704,,Passport(E168554),Spouse,Howard,Susan,,07/16/1968,female,Section 30 Lot 5,,East Sepik Prov,Guinea,531,$5000000/$1000,$1227.05,
06/20/2018,Essential International,863949,020,00072,ARS-03-0042000,201815707,,Passport(505495691),Dependant,Howard,Jimmy,Joseph,10/10/2001,male,Section 30 Lot 5,,East Sepik Prov,Guinea,531,$5000000/$1000,$333,
06/25/2018,Beacon International,863949,020,00072,ARS-01-0042164,201819315,,,,Tsang,Lila,,09/09/2017,female,391 Adelphi St Apt H,New York,Brooklyn,United States,11238,$60000/$250,$7,
06/25/2018,Beacon International,863949,020,00072,ARS-01-0042163,201819314,,,,Tsang,Stephanie,,12/13/1981,female,391 Adelphi St Apt H,New York,Brooklyn,United States,11238,$60000/$250,$9,
06/25/2018,Beacon International,863949,020,00072,ARS-01-0042162,201819313,,,,Tsang,Ryan,,04/02/1983,male,391 Adelphi St Apt H,New York,Brooklyn,United States,11238,$60000/$250,$9,
06/26/2018,Beacon International,863949,020,00072,ARS-01-0042161,201819274,Passport(543548789),,,LARIOS,MONSERRAT,,01/14/2003,female,3633 E. Sebastian Ln,Arizona,Gilbert,United States,85297,$1100000/$0,$24.38,
06/26/2018,Beacon America,863949,020,00072,ARS-02-0042156,201819264,,,,Magier,Simone,,08/14/1946,female,Rua General San Martin 646 / 301,,Rio de Janeiro,Brazil,22410,$50000/$250,$93.6,
06/25/2018,Beacon International,863949,020,00072,ARS-01-0042155,201819263,,,,o&apos;malley,katherine,,06/30/1972,female,9721 dansington ct,North Carolina,raleigh,United States,27615,$550000/$500,$18.34,
06/25/2018,Beacon International,863949,020,00072,ARS-01-0042154,201819262,,,,Sparley,Steven ,R,12/30/1953,male,5206 Spicebush Ln.,Wisconsin,Madison,United States,53714,$110000/$250,$54,
06/25/2018,Beacon International,863949,020,00072,ARS-01-0042153,201819261,,,,Heyn,Thomas,A,06/11/1951,male,5206 Spicebush Ln.,Wisconsin,Madison,United States,53714,$110000/$250,$63.75,
06/25/2018,Beacon International,863949,020,00072,ARS-01-0042150,201819256,,,,Garcia Paz,Maryann,,10/22/1986,female,3709 S Street,Washington,Vancouver,United States,98663,$60000/$0,$32.63,
06/26/2018,Beacon International,863949,020,00072,ARS-01-0042149,201819253,Passport(315036599),,,Hong,Yun Hua,,11/08/1981,male,13006 Parkview Dr,California,Baldwin Park,United States,91706,$2000000/$0,$32.7,
06/25/2018,Beacon International,863949,020,00072,ARS-01-0042148,201819252,,,,Gagne,David,,07/19/1991,male,74 Lilac Lane,Vermont,South Burlington,United States,05403,$110000/$100,$31.35,
06/25/2018,Beacon America,863949,020,00072,ARS-02-0042147,201819251,Passport(J0389372),,,Yashlaha,Prabha,,10/20/1953,male,37864 Bright Common,California,Fremont,United States,94536,$60000/$250,$567,
06/27/2018,Beacon International,863949,020,00072,ARS-01-0042146,201819250,,,,Katz,Jacqueline,,06/05/1953,female,2 Tudor City Place Apt 7H South 10017,,New York,United States,10017,$550000/$100,$64.94,
06/27/2018,Beacon International,863949,020,00072,ARS-01-0042145,201819249,Passport(530865062),,,Katz,Michael,,04/26/1957,male,2 Tudor City Place Apt 7H South 10017,,New York,United States,10017,$550000/$100,$61.38,
06/25/2018,Beacon International,863949,020,00072,ARS-01-0042144,201819248,Passport(AT324902),,,Leiva Muriel,Aura Maria,,03/15/1995,female,CRA 29A3 # 12B78,Valle del Cauca,CALI,Colombia,760032,$1100000/$0,$46.02,
06/26/2018,Beacon America,863949,020,00072,ARS-02-0042143,201819247,Passport(492522911),,,Finch,Hannah,C,10/25/1994,female,10208 Overland Court,,Mint Hill,United States,28227,$1100000/$0,$47.6,
06/24/2018,Beacon America,863949,020,00072,ARS-02-0042142,201819246,Passport(GAC4KG1N3),,,Jasper,Jasmine,,09/21/2000,female,2875 South Orange Are,FL,Orlando,United States,32806,$110000/$1000,$54.81,
06/29/2018,Beacon America,863949,020,00072,ARS-02-0037650,201819246,,,,Malkiel,Alex,,02/18/1987,male,Kornit 14/22,,Nazareth elite,United States,17000,$60000/$0,$188.6,
06/25/2018,Beacon International,863949,020,00072,ARS-01-0042141,201819245,,,,Sparley,Steven,,12/30/1953,male,5206 Spicebush Ln,Wisconsin,Madison,United States,53714,$110000/$250,$54,
06/25/2018,Beacon International,863949,020,00072,ARS-01-0042140,201819244,,,,Heyn,Thomas,,06/11/1951,male,5206 Spicebush Lane,Wisconsin,Madison,United States,53714,$110000/$250,$63.75,
06/24/2018,Beacon International,863949,020,00072,ARS-01-0042139,201819243,Passport(545772383),,,Schue,Jessica,L,09/28/1983,male,21220 Eveleth St.,Minnesota,Cedar,United States,55011,$60000/$0,$25.88,
06/24/2018,Beacon International,863949,020,00072,ARS-01-0042138,201819242,,,,Wood,Christina,M,06/11/1987,female,13408 Spring Gate Lane Apt. 211,Florida,New Port Richey,United States,34654,$1100000/$0,$18.98,
06/24/2018,Beacon International,863949,020,00072,ARS-01-0042137,201819241,,,,Tavakoli,Tara,S,08/07/1994,female,3060 S Peninsula Drive,Florida,Daytona Beach,United States,32118,$60000/$250,$12.92,
06/24/2018,Beacon International,863949,020,00072,ARS-01-0042136,201819240,,,,Julia,Gina,M,12/04/1977,female,18011 Sparrows Nest Dr,Florida,Lutz,United States,33558,$1100000/$0,$27.5,
06/24/2018,Beacon International,863949,020,00072,ARS-01-0042135,201819239,,,,Hernandez,David,,10/23/1991,male,1 Russell St,New York,Wyandanch,United States,11798,$1100000/$0,$20.65,
06/23/2018,Beacon America,863949,020,00072,ARS-02-0042134,201819238,,,,Moroni,Maria Beatrice,,11/21/2003,female,151 West Brookline Street,,Boston,Italy,02118,$550000/$0,$60.75,
06/23/2018,Beacon America,863949,020,00072,ARS-02-0042133,201819237,,,,Sami,Raimonda,,11/27/1958,female,151 West Brookline Street,,Boston,Italy,02118,$550000/$0,$190.35,
06/23/2018,Beacon International,863949,020,00072,ARS-01-0042131,201819235,,,,Zimei,Rocco,S,03/26/2004,male,60 Dudley St,Massachusetts,Leominster,United States,01453,$1100000/$0,$17.88,
06/23/2018,Beacon International,863949,020,00072,ARS-01-0042130,201819234,,,,Zimei,Bettina,C,08/18/1973,female,60 Dudley St,Massachusetts,Leominster,United States,01453,$1100000/$0,$32.5,
06/26/2018,OverseasCare Visitors Insurance Plan,863949,020,00072,OVI-28-0042129,201819233,Passport(L1043274),,,Swaminathan,Lalitha,,04/03/1953,female,1643 Johnson Dr Apt 418,Illinois,Buffalo Grove,United States,60089,$60000/$250,$232.56,
06/26/2018,OverseasCare Visitors Insurance Plan,863949,020,00072,OVI-28-0042128,201819232,Passport(L1043274),,,Nagar Arunachalam,Swaminathan,,12/24/1946,male,1643 Johnson Dr Apt 418,Illinois,Buffalo Grove,United States,60089,$60000/$250,$306,
06/25/2018,Beacon America,863949,020,00072,ARS-02-0042127,201819231,,,,LIANG,WEIYU,,01/25/2008,male,1688 Meiling Road Wanli district ,Jiangxi,Nanchang,China,330004,$110000/$100,$560.56,
06/25/2018,Beacon America,863949,020,00072,ARS-02-0042126,201819230,Passport(EA6871544),,,LIANG,YONGHONG,,06/23/1975,male,1688 Meiling Road Wanli district ,Jiangxi,Nanchang,China,330004,$110000/$100,$1193.19,
06/23/2018,Beacon International,863949,020,00072,ARS-01-0042125,201819229,,,,Grainger,Leslie,A,10/18/1988,female,7900 Harbor Island Drive 725A,Florida,North Bay Village,United States,33141,$60000/$250,$8.36,
06/23/2018,Beacon International,863949,020,00072,ARS-01-0042124,201819228,,,,Brown,Sarah,J,11/28/1987,female,1202 30 Carleton Ave,Alberta,Red Deer,Canada,T4P0M8,$60000/$250,$9.9,
06/28/2018,OverseasCare Visitors Insurance Plan,863949,020,00072,OVI-28-0042123,201819227,,,,Ahmed,Nabeel,,01/06/1994,male,6475 Park pointe ct,Ohio,Pepper pike,India,44124,$110000/$500,$25.2,
06/23/2018,Beacon International,863949,020,00072,ARS-01-0042122,201819226,,,,Tucker,Madison,,06/23/2000,female,4700 S Thompson Suite C-106,Arkansas,Springdale,United States,72764,$1100000/$1000,$8.5,
06/23/2018,Beacon International,863949,020,00072,ARS-01-0042121,201819225,,,,Graham,Joel,,02/21/1993,male,4700 S Thompson Suite C-106,Arkansas,Springdale,United States,72764,$1100000/$1000,$8.5,
06/23/2018,Beacon International,863949,020,00072,ARS-01-0042120,201819224,,,,Graham,Tiffany,,07/22/1993,female,4700 S Thompson Suite C-106,Arkansas,Springdale,United States,72764,$1100000/$1000,$8.5,
06/22/2018,OverseasCare Visitors Insurance Plan,863949,020,00072,OVI-28-0042119,201819223,,,,Kumar,Chhaya,,07/31/1951,female,9017 Chilthorne Ct,North Carolina,Waxhaw,United States,28173,$110000/$250,$189.2,
06/22/2018,OverseasCare Visitors Insurance Plan,863949,020,00072,OVI-28-0042118,201819222,,,,Kumar,Umesh,,07/14/1938,male,9017 Chilthorne Ct,North Carolina,Waxhaw,United States,28173,$110000/$250,$223.6,
06/26/2018,Beacon America,863949,020,00072,ARS-02-0042117,201818854,,,,PIEDRAHITA,TOMAS,,10/11/2014,male,CALLE 17A # 68D 88,Distrito Capltal de Santa Fe de Bogot&atilde;,BOGOTA,Colombia,00000,$550000/$0,$49.5,
06/26/2018,Beacon America,863949,020,00072,ARS-02-0042116,201818853,,,,PIEDRAHITA,MARIA MONICA,,02/24/2001,female,CALLE 17A # 68D 88,Distrito Capltal de Santa Fe de Bogot&atilde;,BOGOTA,Colombia,00000,$550000/$0,$49.5,
06/26/2018,Beacon America,863949,020,00072,ARS-02-0042115,201818852,,,,PIEDRAHITA,MARIA JULIANA,,10/22/1994,female,CALLE 17A # 68D 88,Distrito Capltal de Santa Fe de Bogot&atilde;,BOGOTA,Colombia,00000,$550000/$0,$59.95,
06/26/2018,Beacon America,863949,020,00072,ARS-02-0042114,201818851,,,,PIEDRAHITA,DIEGO,A,05/14/1987,male,CALLE 17A # 68D 88,Distrito Capltal de Santa Fe de Bogot&atilde;,BOGOTA,Colombia,00000,$550000/$0,$70.95,
06/26/2018,Beacon America,863949,020,00072,ARS-02-0042113,201818850,,,,OSORIO,MARIA MONICA,,09/13/1966,female,CALLE 17A # 68D 88,Distrito Capltal de Santa Fe de Bogot&atilde;,BOGOTA,Colombia,00000,$550000/$0,$155.1,
06/26/2018,Beacon America,863949,020,00072,ARS-02-0042112,201818849,Passport(PE136284),,,PIEDRAHITA,ORLANDO,,02/01/1962,male,CALLE 17A # 68D 88,Distrito Capltal de Santa Fe de Bogot&atilde;,BOGOTA,Colombia,00000,$550000/$0,$155.1,
06/22/2018,OverseasCare Visitors Insurance Plan,863949,020,00072,OVI-28-0042110,201818847,Passport(P3796124),,,Surampalli,krishna kumari,,05/05/1964,female,43555 grimmer blvd,California,FREMONT,United States,94538,$60000/$250,$155.1,
06/22/2018,OverseasCare Visitors Insurance Plan,863949,020,00072,OVI-28-0042109,201818846,Passport(P3796124),,,Surampalli,Pulla Rao,,01/09/1958,male,43555 grimmer blvd,California,FREMONT,United States,94538,$60000/$250,$188.1,
06/22/2018,Beacon International,863949,020,00072,ARS-01-0042107,201818844,,,,Domm,Allison,E,03/16/1998,female,14 COTSWOLD WAY,New York,SCARSDALE,United States,10583,$110000/$250,$57,
06/22/2018,OverseasCare Visitors Insurance Plan,863949,020,00072,OVI-28-0042106,201818843,,,,Yalamanchili,Aruna Kumari,,07/15/1953,female,9017 Chilthorne Ct,North Carolina,Waxhaw,United States,28173,$110000/$250,$248.6,
06/22/2018,Beacon International,863949,020,00072,ARS-01-0042094,201818802,,,,Lichtenshtein,Boris,,08/30/1963,male,67 DAWN RD,New York,ROCKY POINT,United States,11778,$2000000/$0,$57.75,
06/15/2018,Beacon International,863949,020,00072,ARS-01-0042093,201818801,,,,Boren,Sarah,,11/17/1990,female,PO Box 64,Mississippi,Courtland,United States,38620,$2000000/$0,$26.65,
06/22/2018,Beacon America,863949,020,00072,ARS-02-0042089,201818783,,,,DORAN,JULIA,M,10/20/1985,female,205 3rd Avenue,New York,New York,United States,10003,$60000/$250,$8.2,
06/22/2018,Beacon International,863949,020,00072,ARS-01-0042087,201818781,,,,Thompson,Lionel,,11/06/1974,male,3719 Tree Farm Lane,Washington,Bellingham,United States,98226,$60000/$250,$36,
06/22/2018,Beacon International,863949,020,00072,ARS-01-0042086,201818777,,,,Thompson,kezia,,11/16/2001,female,3719 Tree Farm Lane,Washington,Bellingham,United States,98226,$60000/$250,$16.8,
06/28/2018,Beacon America,863949,020,00072,ARS-02-0042084,201818775,Passport(45465465),,,Mohandoss,Karthikeyan,,01/01/2000,male,No 23 Pushpa Nagar,TN,Chennai,,600034,$60000/$2500,$4.34,
06/21/2018,Beacon America,863949,020,00072,ARS-02-0042083,201817615,Passport(723578021),,,Burova,Irina,,08/25/1963,female,120 Locksunart Way,California,Sunnyvale,United States,94087,$110000/$0,$125.95,
06/21/2018,Beacon International,863949,020,00072,ARS-01-0042081,201817613,Passport(528384320),,,Savage Jr,Tony,J,09/14/1995,male,2610 Brandon Terrace,Missouri,Sedalia,United States,65301,$2000000/$0,$365.3,
06/23/2018,Beacon America,863949,020,00072,ARS-02-0042080,201817612,,,,Ghule,Anand,Shripad,10/30/1966,male,4018 W Hollow Parkway,Texas,Houston,United States,77082,$60000/$0,$40.5,
06/22/2018,Essential America,863949,020,00072,ARS-03-0041453,201801837,Driving License(O452-4309-5667),,,Olmos Figueroa,Jocelyn,J.,03/05/1995,female,1450 N. Homan,Illinois,Chicago,United States,60651,$5000000/$250,$1360,
06/22/2018,Beacon International,863949,020,00072,ARS-01-0042076,201817605,Passport(575025592),,,Palma,Katie,E,01/31/1972,female,326 Pepperwood st,Texas,Coppell,United States,75019,$110000/$0,$11.25,
06/22/2018,Essential America,863949,020,00072,ARS-03-0041502,201802541,Passport(YC493134),,,COSTA ARAUJO,KELLY,C,12/24/1978,female,11521 ISLAND LAKES LN,Florida,BOCA RATON,United States,33498,$5000000/$250,$2023,
06/22/2018,Essential America,863949,020,00072,ARS-03-0041502,201802543,,Passport(YC462440),Dependant,COSTA PARRAS JUNIOR,EDUARDO,,04/04/2003,male,11521 ISLAND LAKES LN,Florida,BOCA RATON,United States,33498,$5000000/$250,$602,
06/22/2018,Essential America,863949,020,00072,ARS-03-0041502,201802546,,Passport(YC492705),Dependant,COSTA PARRAS,MURILO,,06/23/2006,male,11521 ISLAND LAKES LN,Florida,BOCA RATON,United States,33498,$5000000/$250,$602,
06/21/2018,Beacon International,863949,020,00072,ARS-01-0042074,201817303,,,,yom,myunghak,,03/07/1931,male,900 grand concourse,New York,bronx,United States,10451,$12000/$500,$154.8,
06/21/2018,Beacon International,863949,020,00072,ARS-01-0042072,201817301,,,,Kung,David,,11/06/1976,male,246 Yellowstone Ave.,California,Thousand Oaks,United States,91320,$550000/$500,$72.32,
06/21/2018,Beacon International,863949,020,00072,ARS-01-0042071,201817300,,,,Johnson,Francine,,08/27/1973,female,2410 w lake sammamish pkwy ne,Washington,Redmond,United States,98052,$550000/$250,$33.32,
06/21/2018,Beacon International,863949,020,00072,ARS-01-0042070,201817299,,,,Johnson,Peter,,11/10/1970,male,2410 w lake sammamish pkwy ne,Washington,Redmond,United States,98052,$550000/$250,$33.32,
06/22/2018,Beacon America,863949,020,00072,ARS-02-0042069,201817293,,,,Slote,Kyle,D,12/05/1984,male,145 Herkimer Street,Ontario,Hamilton,Canada,L8P2H2,$60000/$0,$10.25,
06/22/2018,Beacon International,863949,020,00072,ARS-01-0042067,201817249,,,,Wolfe,Shannon,,10/16/1974,female,92 Peralta Avenue,California,San Francisco,United States,94110,$550000/$100,$47.43,
06/22/2018,Beacon International,863949,020,00072,ARS-01-0042066,201817248,,,,Jones,Stephen,,04/16/1973,male,92 Peralta Avenue,California,San Francisco,United States,94110,$550000/$100,$47.43,
06/21/2018,Beacon International,863949,020,00072,ARS-01-0042065,201817247,,,,McKee,Natalie,,01/02/1996,female,1001 E Playa Del Norte Dr Unit 4305,Arizona,Tempe,United States,85281,$60000/$0,$14.25,
06/21/2018,Beacon International,863949,020,00072,ARS-01-0042064,201817246,,,,Palomarez,Joseph,C,06/01/1997,male,1001 E Playa Del Norte Dr Unit 4305,Arizona,Tempe,United States,85281,$60000/$0,$14.25,
06/22/2018,Beacon America,863949,020,00072,ARS-02-0041243,201839624,,,,Sokamte,Adonis,,02/04/1956,male,900 Long Boulevard,Michigan,Lansing,United States,48906,$60000/$250,$135,
06/20/2018,Beacon International,863949,020,00072,ARS-01-0042061,201816160,,,,Beil,Lawrence,A,01/07/1961,male,631 Exeter Place,California,Danville,United States,94506,$60000/$250,$33.8,
06/20/2018,Beacon International,863949,020,00072,ARS-01-0042060,201816159,,,,Beil,Sharla,J,12/05/1960,female,631 Exeter Place,California,Danville,United States,94506,$60000/$250,$33.8,
06/20/2018,Beacon International,863949,020,00072,ARS-01-0042059,201816158,,,,Beil,Nicole,H,12/22/1997,female,631 Exeter Place,California,Danville,United States,94506,$60000/$250,$9.88,
06/20/2018,Beacon America,863949,020,00072,ARS-02-0042055,201815798,,,,Kaba,Ingrid,,06/21/1983,female,1041 Redmond Ct,,nashville,Brazil,37211,$60000/$250,$18.04,
06/20/2018,Beacon International,863949,020,00072,ARS-01-0042030,201815773,,,,Vought,Daniel,W,05/11/1983,male,8261 N Suwannee Dr,Arizona,Tucson,United States,85741,$60000/$250,$12.6,
06/20/2018,Beacon International,863949,020,00072,ARS-01-0042029,201815772,,,,Vought,Leland,C,11/07/1981,male,8261 N Suwannee Dr,Arizona,Tucson,United States,85741,$60000/$250,$12.6,
06/20/2018,Beacon International,863949,020,00072,ARS-01-0042028,201815771,,,,Blackmore,Elise,M,11/16/1991,female,8261 N Suwannee Dr,Arizona,Tucson,United States,85741,$60000/$250,$10.64,
06/26/2018,Beacon International,863949,020,00072,ARS-01-0042027,201815770,,,,Sussman,Leah,,07/31/1961,female,1 Chiconos Dr,New Jersey,Lakewood,United States,08701,$2000000/$0,$51.98,
06/26/2018,Beacon International,863949,020,00072,ARS-01-0042026,201815769,,,,Sussman,Aaron,,06/16/1958,male,1 Chiconos Dr,New Jersey,Lakewood,United States,08701,$2000000/$0,$70.31,
06/20/2018,Beacon International,863949,020,00072,ARS-01-0042022,201815764,,,,Heidenreich,Nicole,C,06/22/1988,female,2121 E Pratt ST,Maryland,BALTIMORE,United States,21231,$60000/$250,$9.88,