Original Effective Date,Plan Type,Control,Suffix,Account,Policy Number,ID,EE SSN,Dependent SSN,Dependent Relationship,Last Name,First Name,Middle Initial,DOB,Gender,Address,State,City,Country,Postcode,Max/Ded,Premium,
06/28/2018,Beacon International,863949,020,00072,ARS-01-0042256,201823006,,,,GARCIA,ULISES,,09/09/1979,male,GUADALAJARA 203,,Jalapa,Mexico,91130,$60000/$250,$13.5,
06/28/2018,Beacon America,863949,020,00072,ARS-02-0042212,201819985,Passport(207753245),,,Quan Chan,Flora,Tiffany,10/18/1991,female,15 Park Bl,Virginia,Staunton,United States,24401,$550000/$100,$304.55,
06/28/2018,Beacon America,863949,020,00072,ARS-02-0042084,201818775,Passport(45465465),,,Mohandoss,Karthikeyan,,01/01/2000,male,No 23 Pushpa Nagar,TN,Chennai,,600034,$60000/$2500,$4.34,
06/28/2018,Beacon International,863949,020,00072,ARS-01-0041937,201812979,,,,gamble,alan,j,01/31/1961,male,16 henderson road,,cheshire,United Kingdom,wa8 7lr,$60000/$250,$13,
06/28/2018,Beacon America,863949,020,00072,ARS-02-0040374,201829032,Passport(na),,,Aguirre Molina,Felipe Alberto,,10/05/1989,male,National Center for State Courts,Distrito Capltal de Santa Fe de Bogot&atilde;,Bogota,Colombia,na,$550000/$0,$106.28,
06/28/2018,Beacon America,863949,020,00072,ARS-02-0040373,201850874,Passport(na),,,Contreras Barragan,Carlos Andres,,04/03/1990,male,National Center for State Courts,Distrito Capltal de Santa Fe de Bogot&atilde;,Bogota,Colombia,na,$550000/$0,$106.28,
06/28/2018,Beacon International,863949,020,00072,ARS-01-0041767,201809395,,,,Muboyayi,Polydor,,09/15/1948,male,12125 Amber Ridge Cir,,Germantown,United States,20876,$60000/$500,$27.94,
06/28/2018,Beacon International,863949,020,00072,ARS-01-0041631,201807244,,,,Hodges,Isaiah,,08/13/2014,male,3628 E Mitchell,Tennessee,Humboldt,United States,38343,$1100000/$0,$41.25,
06/28/2018,Beacon International,863949,020,00072,ARS-01-0041630,201807243,,,,Hodges,Alayna,,01/04/2013,female,3628 E Mitchell,Tennessee,Humboldt,United States,38343,$1100000/$0,$41.25,
06/28/2018,Beacon International,863949,020,00072,ARS-01-0041629,201807242,,,,Hodges,Joshua,,04/30/2011,male,3628 E Mitchell,Tennessee,Humboldt,United States,38343,$1100000/$0,$41.25,
06/28/2018,Beacon International,863949,020,00072,ARS-01-0041628,201807241,,,,Hodges,Rebekah,,06/20/1988,female,3628 E Mitchell,Tennessee,Humboldt,United States,38343,$1100000/$0,$51.75,
06/28/2018,Beacon International,863949,020,00072,ARS-01-0041627,201807240,Passport(509818684),,,Hodges,Daniel,,07/03/1987,male,3628 E Mitchell,Tennessee,Humboldt,United States,38343,$1100000/$0,$51.75,
06/28/2018,Beacon International,863949,020,00072,ARS-01-0041012,201867140,,,,arutyunyan,karine,,07/18/1985,female,215 E Garfield ave apt 10,California,Glendale,United States,91205,$60000/$250,$4.5,
06/28/2018,Beacon International,863949,020,00072,ARS-01-0040717,201868715,,,,ALHUSSEINI,ZAYNA,,02/20/1981,female,790 BOYLSTON ST,Massachusetts,BOSTON,United States,02199,$60000/$250,$9.9