Original Effective Date,Plan Type,Control,Suffix,Account,Policy Number,ID,EE SSN,Dependent SSN,Dependent Relationship,Last Name,First Name,Middle Initial,DOB,Gender,Country,Max/Ded,Premium,
06/26/2018,Beacon International,863949,020,00072,ARS-01-0042202,201819972,,,,Kubali,Selin,,04/06/2001,female,United States,$60000/$250,$9.1,
06/26/2018,Beacon International,863949,020,00072,ARS-01-0042201,201819971,,,,Kubali,Kimberly,,07/02/1968,female,United States,$60000/$250,$19.5,
06/26/2018,Beacon International,863949,020,00072,ARS-01-0042200,201819969,,,,Cordileone,Salvatore,J,06/05/1956,male,United States,$550000/$250,$69.75,
06/26/2018,Beacon International,863949,020,00072,ARS-01-0042187,201819947,,,,Schwab,Cole,J,03/03/2016,male,United States,$60000/$250,$23.1,
06/26/2018,Beacon International,863949,020,00072,ARS-01-0042186,201819946,,,,Rajala,Annemaria,,03/08/1979,female,United States,$60000/$250,$29.7,
06/26/2018,Beacon America,863949,020,00072,ARS-02-0042185,201819945,Passport(H3662902),,,Bobde,Shobha,,06/08/1948,female,United States,$50000/$250,$446.4,
06/26/2018,Beacon America,863949,020,00072,ARS-02-0042183,201819943,Passport(H3662906 11),,,Bobde,Prakash,,11/13/1941,male,United States,$50000/$250,$446.4,
06/26/2018,Beacon International,863949,020,00072,ARS-01-0042181,201819932,,,,Muser,Basya,,07/23/1996,female,United States,$550000/$0,$13.75,
06/26/2018,Beacon International,863949,020,00072,ARS-01-0042180,201819931,,,,Muser,Tzvi,,08/31/1992,male,United States,$550000/$0,$13.75,
06/26/2018,Beacon International,863949,020,00072,ARS-01-0042179,201819894,,,,Mahoney,NIcole,,01/25/1988,female,United States,$60000/$250,$16.2,
06/26/2018,Beacon International,863949,020,00072,ARS-01-0042178,201819893,,,,Mahoney,Ligia,,09/25/1963,female,United States,$60000/$250,$46.8,
06/26/2018,Enhanced America,863949,020,00072,ARS-04-0042098,201818806,Passport(KD841769),,,Silva,Karin,B,05/14/1969,female,India,$5000000/$1000,$2714,
06/26/2018,Beacon International,863949,020,00072,ARS-01-0042176,201819869,,,,capoor,preeti,,11/26/1966,female,Canada,$60000/$500,$25.74,
06/26/2018,Beacon International,863949,020,00072,ARS-01-0042175,201819868,Passport(hk865405),,,masrani,rajesh,,05/20/1959,male,Canada,$60000/$500,$25.74,
06/26/2018,Beacon International,863949,020,00072,ARS-01-0042173,201819745,,,,yosopovici,Erez,G,09/17/2006,male,United States,$1100000/$250,$17.6,
06/26/2018,Beacon International,863949,020,00072,ARS-01-0042172,201819744,,,,yosopovici,Hilary,i,12/21/1965,female,United States,$1100000/$250,$50.24,
06/25/2018,Essential International,863949,020,00072,ARS-03-0041731,201809118,Passport(483701301),,,Howard,James,Reginald,10/09/1958,male,Papua new Guinea,$5000000/$1000,$1381,
06/25/2018,Essential International,863949,020,00072,ARS-03-0041731,201809120,,Passport(E168554),Spouse,Howard,Susan,,07/16/1968,female,Papua new Guinea,$5000000/$1000,$1227.05,
06/25/2018,Essential International,863949,020,00072,ARS-03-0041731,201809123,,Passport(E174789),Dependant,Howard,Jimmy,Joseph,10/10/2001,male,Papua new Guinea,$5000000/$1000,$333,
06/20/2018,Essential International,863949,020,00072,ARS-03-0042000,201815702,Passport(531762360),,,Howard,James,Reginald,10/09/1958,male,Guinea,$5000000/$1000,$1381,
06/20/2018,Essential International,863949,020,00072,ARS-03-0042000,201815704,,Passport(E168554),Spouse,Howard,Susan,,07/16/1968,female,Guinea,$5000000/$1000,$1227.05,
06/20/2018,Essential International,863949,020,00072,ARS-03-0042000,201815707,,Passport(505495691),Dependant,Howard,Jimmy,Joseph,10/10/2001,male,Guinea,$5000000/$1000,$333,
06/25/2018,Beacon International,863949,020,00072,ARS-01-0042164,201819315,,,,Tsang,Lila,,09/09/2017,female,United States,$60000/$250,$7,
06/25/2018,Beacon International,863949,020,00072,ARS-01-0042163,201819314,,,,Tsang,Stephanie,,12/13/1981,female,United States,$60000/$250,$9,
06/25/2018,Beacon International,863949,020,00072,ARS-01-0042162,201819313,,,,Tsang,Ryan,,04/02/1983,male,United States,$60000/$250,$9,
06/26/2018,Beacon International,863949,020,00072,ARS-01-0042161,201819274,Passport(543548789),,,LARIOS,MONSERRAT,,01/14/2003,female,United States,$1100000/$0,$24.38,
06/26/2018,Beacon America,863949,020,00072,ARS-02-0042156,201819264,,,,Magier,Simone,,08/14/1946,female,Brazil,$50000/$250,$93.6,
06/25/2018,Beacon International,863949,020,00072,ARS-01-0042155,201819263,,,,o&apos;malley,katherine,,06/30/1972,female,United States,$550000/$500,$18.34,
06/25/2018,Beacon International,863949,020,00072,ARS-01-0042154,201819262,,,,Sparley,Steven ,R,12/30/1953,male,United States,$110000/$250,$54,
06/25/2018,Beacon International,863949,020,00072,ARS-01-0042153,201819261,,,,Heyn,Thomas,A,06/11/1951,male,United States,$110000/$250,$63.75,
06/25/2018,Beacon International,863949,020,00072,ARS-01-0042150,201819256,,,,Garcia Paz,Maryann,,10/22/1986,female,United States,$60000/$0,$32.63,
06/26/2018,Beacon International,863949,020,00072,ARS-01-0042149,201819253,Passport(315036599),,,Hong,Yun Hua,,11/08/1981,male,United States,$2000000/$0,$32.7,
06/25/2018,Beacon International,863949,020,00072,ARS-01-0042148,201819252,,,,Gagne,David,,07/19/1991,male,United States,$110000/$100,$31.35,
06/25/2018,Beacon America,863949,020,00072,ARS-02-0042147,201819251,Passport(J0389372),,,Yashlaha,Prabha,,10/20/1953,male,United States,$60000/$250,$567,
06/27/2018,Beacon International,863949,020,00072,ARS-01-0042146,201819250,,,,Katz,Jacqueline,,06/05/1953,female,United States,$550000/$100,$64.94,
06/27/2018,Beacon International,863949,020,00072,ARS-01-0042145,201819249,Passport(530865062),,,Katz,Michael,,04/26/1957,male,United States,$550000/$100,$61.38,
06/25/2018,Beacon International,863949,020,00072,ARS-01-0042144,201819248,Passport(AT324902),,,Leiva Muriel,Aura Maria,,03/15/1995,female,Colombia,$1100000/$0,$46.02,
06/26/2018,Beacon America,863949,020,00072,ARS-02-0042143,201819247,Passport(492522911),,,Finch,Hannah,C,10/25/1994,female,United States,$1100000/$0,$47.6,
06/24/2018,Beacon America,863949,020,00072,ARS-02-0042142,201819246,Passport(GAC4KG1N3),,,Jasper,Jasmine,,09/21/2000,female,United States,$110000/$1000,$54.81,
06/25/2018,Beacon International,863949,020,00072,ARS-01-0042141,201819245,,,,Sparley,Steven,,12/30/1953,male,United States,$110000/$250,$54,
06/25/2018,Beacon International,863949,020,00072,ARS-01-0042140,201819244,,,,Heyn,Thomas,,06/11/1951,male,United States,$110000/$250,$63.75,
06/24/2018,Beacon International,863949,020,00072,ARS-01-0042139,201819243,Passport(545772383),,,Schue,Jessica,L,09/28/1983,male,United States,$60000/$0,$25.88,
06/24/2018,Beacon International,863949,020,00072,ARS-01-0042138,201819242,,,,Wood,Christina,M,06/11/1987,female,United States,$1100000/$0,$18.98,
06/24/2018,Beacon International,863949,020,00072,ARS-01-0042137,201819241,,,,Tavakoli,Tara,S,08/07/1994,female,United States,$60000/$250,$12.92,
06/24/2018,Beacon International,863949,020,00072,ARS-01-0042136,201819240,,,,Julia,Gina,M,12/04/1977,female,United States,$1100000/$0,$27.5,
06/24/2018,Beacon International,863949,020,00072,ARS-01-0042135,201819239,,,,Hernandez,David,,10/23/1991,male,United States,$1100000/$0,$20.65,
06/23/2018,Beacon America,863949,020,00072,ARS-02-0042134,201819238,,,,Moroni,Maria Beatrice,,11/21/2003,female,Italy,$550000/$0,$60.75,
06/23/2018,Beacon America,863949,020,00072,ARS-02-0042133,201819237,,,,Sami,Raimonda,,11/27/1958,female,Italy,$550000/$0,$190.35,
06/23/2018,Beacon International,863949,020,00072,ARS-01-0042131,201819235,,,,Zimei,Rocco,S,03/26/2004,male,United States,$1100000/$0,$17.88,
06/23/2018,Beacon International,863949,020,00072,ARS-01-0042130,201819234,,,,Zimei,Bettina,C,08/18/1973,female,United States,$1100000/$0,$32.5,
06/26/2018,OverseasCare Visitors Insurance Plan,863949,020,00072,OVI-28-0042129,201819233,Passport(L1043274),,,Swaminathan,Lalitha,,04/03/1953,female,United States,$60000/$250,$232.56,
06/26/2018,OverseasCare Visitors Insurance Plan,863949,020,00072,OVI-28-0042128,201819232,Passport(L1043274),,,Nagar Arunachalam,Swaminathan,,12/24/1946,male,United States,$60000/$250,$306,
06/25/2018,Beacon America,863949,020,00072,ARS-02-0042127,201819231,,,,LIANG,WEIYU,,01/25/2008,male,China,$110000/$100,$560.56,
06/25/2018,Beacon America,863949,020,00072,ARS-02-0042126,201819230,Passport(EA6871544),,,LIANG,YONGHONG,,06/23/1975,male,China,$110000/$100,$1193.19,
06/23/2018,Beacon International,863949,020,00072,ARS-01-0042125,201819229,,,,Grainger,Leslie,A,10/18/1988,female,United States,$60000/$250,$8.36,
06/23/2018,Beacon International,863949,020,00072,ARS-01-0042124,201819228,,,,Brown,Sarah,J,11/28/1987,female,Canada,$60000/$250,$9.9,
06/23/2018,Beacon International,863949,020,00072,ARS-01-0042122,201819226,,,,Tucker,Madison,,06/23/2000,female,United States,$1100000/$1000,$8.5,
06/23/2018,Beacon International,863949,020,00072,ARS-01-0042121,201819225,,,,Graham,Joel,,02/21/1993,male,United States,$1100000/$1000,$8.5,
06/23/2018,Beacon International,863949,020,00072,ARS-01-0042120,201819224,,,,Graham,Tiffany,,07/22/1993,female,United States,$1100000/$1000,$8.5,
06/22/2018,OverseasCare Visitors Insurance Plan,863949,020,00072,OVI-28-0042119,201819223,,,,Kumar,Chhaya,,07/31/1951,female,United States,$110000/$250,$189.2,
06/22/2018,OverseasCare Visitors Insurance Plan,863949,020,00072,OVI-28-0042118,201819222,,,,Kumar,Umesh,,07/14/1938,male,United States,$110000/$250,$223.6,
06/26/2018,Beacon America,863949,020,00072,ARS-02-0042117,201818854,,,,PIEDRAHITA,TOMAS,,10/11/2014,male,Colombia,$550000/$0,$49.5,
06/26/2018,Beacon America,863949,020,00072,ARS-02-0042116,201818853,,,,PIEDRAHITA,MARIA MONICA,,02/24/2001,female,Colombia,$550000/$0,$49.5,
06/26/2018,Beacon America,863949,020,00072,ARS-02-0042115,201818852,,,,PIEDRAHITA,MARIA JULIANA,,10/22/1994,female,Colombia,$550000/$0,$59.95,
06/26/2018,Beacon America,863949,020,00072,ARS-02-0042114,201818851,,,,PIEDRAHITA,DIEGO,A,05/14/1987,male,Colombia,$550000/$0,$70.95,
06/26/2018,Beacon America,863949,020,00072,ARS-02-0042113,201818850,,,,OSORIO,MARIA MONICA,,09/13/1966,female,Colombia,$550000/$0,$155.1,
06/26/2018,Beacon America,863949,020,00072,ARS-02-0042112,201818849,Passport(PE136284),,,PIEDRAHITA,ORLANDO,,02/01/1962,male,Colombia,$550000/$0,$155.1,
06/22/2018,OverseasCare Visitors Insurance Plan,863949,020,00072,OVI-28-0042110,201818847,Passport(P3796124),,,Surampalli,krishna kumari,,05/05/1964,female,United States,$60000/$250,$155.1,
06/22/2018,OverseasCare Visitors Insurance Plan,863949,020,00072,OVI-28-0042109,201818846,Passport(P3796124),,,Surampalli,Pulla Rao,,01/09/1958,male,United States,$60000/$250,$188.1,
06/22/2018,Beacon International,863949,020,00072,ARS-01-0042107,201818844,,,,Domm,Allison,E,03/16/1998,female,United States,$110000/$250,$57,
06/22/2018,OverseasCare Visitors Insurance Plan,863949,020,00072,OVI-28-0042106,201818843,,,,Yalamanchili,Aruna Kumari,,07/15/1953,female,United States,$110000/$250,$248.6,
06/22/2018,Beacon International,863949,020,00072,ARS-01-0042094,201818802,,,,Lichtenshtein,Boris,,08/30/1963,male,United States,$2000000/$0,$57.75,
06/15/2018,Beacon International,863949,020,00072,ARS-01-0042093,201818801,,,,Boren,Sarah,,11/17/1990,female,United States,$2000000/$0,$26.65,
06/22/2018,Beacon America,863949,020,00072,ARS-02-0042089,201818783,,,,DORAN,JULIA,M,10/20/1985,female,United States,$60000/$250,$8.2,
06/22/2018,Beacon International,863949,020,00072,ARS-01-0042087,201818781,,,,Thompson,Lionel,,11/06/1974,male,United States,$60000/$250,$36,
06/22/2018,Beacon International,863949,020,00072,ARS-01-0042086,201818777,,,,Thompson,kezia,,11/16/2001,female,United States,$60000/$250,$16.8,
06/21/2018,Beacon America,863949,020,00072,ARS-02-0042083,201817615,Passport(723578021),,,Burova,Irina,,08/25/1963,female,United States,$110000/$0,$125.95,
06/21/2018,Beacon International,863949,020,00072,ARS-01-0042081,201817613,Passport(528384320),,,Savage Jr,Tony,J,09/14/1995,male,United States,$2000000/$0,$365.3,
06/23/2018,Beacon America,863949,020,00072,ARS-02-0042080,201817612,,,,Ghule,Anand,Shripad,10/30/1966,male,United States,$60000/$0,$40.5,
06/22/2018,Essential America,863949,020,00072,ARS-03-0041453,201801837,Driving License(O452-4309-5667),,,Olmos Figueroa,Jocelyn,J.,03/05/1995,female,United States,$5000000/$250,$1360,
06/22/2018,Beacon International,863949,020,00072,ARS-01-0042076,201817605,Passport(575025592),,,Palma,Katie,E,01/31/1972,female,United States,$110000/$0,$11.25,
06/22/2018,Essential America,863949,020,00072,ARS-03-0041502,201802541,Passport(YC493134),,,COSTA ARAUJO,KELLY,C,12/24/1978,female,United States,$5000000/$250,$2023,
06/22/2018,Essential America,863949,020,00072,ARS-03-0041502,201802543,,Passport(YC462440),Dependant,COSTA PARRAS JUNIOR,EDUARDO,,04/04/2003,male,United States,$5000000/$250,$602,
06/22/2018,Essential America,863949,020,00072,ARS-03-0041502,201802546,,Passport(YC492705),Dependant,COSTA PARRAS,MURILO,,06/23/2006,male,United States,$5000000/$250,$602,
06/21/2018,Beacon International,863949,020,00072,ARS-01-0042074,201817303,,,,yom,myunghak,,03/07/1931,male,United States,$12000/$500,$154.8,
06/21/2018,Beacon International,863949,020,00072,ARS-01-0042072,201817301,,,,Kung,David,,11/06/1976,male,United States,$550000/$500,$72.32,
06/21/2018,Beacon International,863949,020,00072,ARS-01-0042071,201817300,,,,Johnson,Francine,,08/27/1973,female,United States,$550000/$250,$33.32,
06/21/2018,Beacon International,863949,020,00072,ARS-01-0042070,201817299,,,,Johnson,Peter,,11/10/1970,male,United States,$550000/$250,$33.32,
06/22/2018,Beacon America,863949,020,00072,ARS-02-0042069,201817293,,,,Slote,Kyle,D,12/05/1984,male,Canada,$60000/$0,$10.25,
06/22/2018,Beacon International,863949,020,00072,ARS-01-0042067,201817249,,,,Wolfe,Shannon,,10/16/1974,female,United States,$550000/$100,$47.43,
06/22/2018,Beacon International,863949,020,00072,ARS-01-0042066,201817248,,,,Jones,Stephen,,04/16/1973,male,United States,$550000/$100,$47.43,
06/21/2018,Beacon International,863949,020,00072,ARS-01-0042065,201817247,,,,McKee,Natalie,,01/02/1996,female,United States,$60000/$0,$14.25,
06/21/2018,Beacon International,863949,020,00072,ARS-01-0042064,201817246,,,,Palomarez,Joseph,C,06/01/1997,male,United States,$60000/$0,$14.25,
06/22/2018,Beacon America,863949,020,00072,ARS-02-0041243,201839624,,,,Sokamte,Adonis,,02/04/1956,male,United States,$60000/$250,$135,
06/20/2018,Beacon International,863949,020,00072,ARS-01-0042061,201816160,,,,Beil,Lawrence,A,01/07/1961,male,United States,$60000/$250,$33.8,
06/20/2018,Beacon International,863949,020,00072,ARS-01-0042060,201816159,,,,Beil,Sharla,J,12/05/1960,female,United States,$60000/$250,$33.8,
06/20/2018,Beacon International,863949,020,00072,ARS-01-0042059,201816158,,,,Beil,Nicole,H,12/22/1997,female,United States,$60000/$250,$9.88,
06/20/2018,Beacon America,863949,020,00072,ARS-02-0042055,201815798,,,,Kaba,Ingrid,,06/21/1983,female,Brazil,$60000/$250,$18.04,
06/20/2018,Beacon International,863949,020,00072,ARS-01-0042030,201815773,,,,Vought,Daniel,W,05/11/1983,male,United States,$60000/$250,$12.6,
06/20/2018,Beacon International,863949,020,00072,ARS-01-0042029,201815772,,,,Vought,Leland,C,11/07/1981,male,United States,$60000/$250,$12.6,
06/20/2018,Beacon International,863949,020,00072,ARS-01-0042028,201815771,,,,Blackmore,Elise,M,11/16/1991,female,United States,$60000/$250,$10.64,
06/26/2018,Beacon International,863949,020,00072,ARS-01-0042027,201815770,,,,Sussman,Leah,,07/31/1961,female,United States,$2000000/$0,$51.98,
06/26/2018,Beacon International,863949,020,00072,ARS-01-0042026,201815769,,,,Sussman,Aaron,,06/16/1958,male,United States,$2000000/$0,$70.31,
06/20/2018,Beacon International,863949,020,00072,ARS-01-0042022,201815764,,,,Heidenreich,Nicole,C,06/22/1988,female,United States,$60000/$250,$9.88,
06/20/2018,Beacon International,863949,020,00072,ARS-01-0042021,201815741,,,,Zommere,Laura,,11/08/1986,female,United States,$550000/$1000,$12.96,
06/20/2018,Beacon International,863949,020,00072,ARS-01-0042020,201815740,,,,Pandey,Vivek,,06/23/1985,male,United States,$550000/$1000,$12.96,
06/20/2018,Beacon International,863949,020,00072,ARS-01-0042019,201815739,,,,Regan,Joey,D,02/05/1998,male,United States,$60000/$250,$13.68,
06/20/2018,Beacon International,863949,020,00072,ARS-01-0042018,201815738,,,,Regan,Hannah,R,03/19/2000,female,United States,$60000/$250,$13.68,
06/20/2018,Beacon International,863949,020,00072,ARS-01-0042017,201815737,,,,Jensen,William,T,04/25/2000,male,United States,$110000/$250,$16.15,
06/20/2018,Beacon International,863949,020,00072,ARS-01-0042016,201815736,,,,Jensen,Elizabeth,I,11/23/1996,female,United States,$110000/$250,$16.15,
06/20/2018,Beacon International,863949,020,00072,ARS-01-0042015,201815735,,,,Jensen,Ann,M,08/22/1965,female,United States,$110000/$250,$51.34,
06/20/2018,Beacon International,863949,020,00072,ARS-01-0042014,201815734,,,,Jensen,Lance,P,05/18/1960,male,United States,$110000/$250,$51.34,
06/21/2018,Beacon America,863949,020,00072,ARS-02-0042013,201815733,Passport(S2938673),,,MAHADEVAN,ANURADHA,,12/19/1987,male,United States,$60000/$100,$68.55,
06/22/2018,Beacon International,863949,020,00072,ARS-01-0042012,201815732,,,,Talamantez,Marvin,,08/06/1965,male,United States,$60000/$250,$13,
06/22/2018,Beacon International,863949,020,00072,ARS-01-0042011,201815731,,,,Flores,Rosa,L,08/29/1962,female,United States,$60000/$250,$13,
06/22/2018,Beacon International,863949,020,00072,ARS-01-0042010,201815730,,,,Frame,Debra,,09/12/1953,female,United States,$60000/$250,$16.25,
06/22/2018,Beacon International,863949,020,00072,ARS-01-0042009,201815729,,,,Palacios,Elvia,,04/01/1955,female,United States,$60000/$250,$16.25,
06/22/2018,Beacon International,863949,020,00072,ARS-01-0042008,201815728,,,,Enstall,Karrie,,04/12/1960,female,United States,$60000/$250,$13,
06/22/2018,Beacon International,863949,020,00072,ARS-01-0042007,201815727,,,,Stewart,Glenda,,07/25/1956,female,United States,$60000/$250,$16.25,
06/22/2018,Beacon International,863949,020,00072,ARS-01-0042006,201815726,,,,Stewart,Kenneth,D,06/27/1955,male,United States,$60000/$250,$16.25,
06/21/2018,Beacon America,863949,020,00072,ARS-02-0042003,201815723,,,,Eisenberg,Saadia,,01/01/1970,female,Israel,$550000/$0,$390,
06/20/2018,Beacon International,863949,020,00072,ARS-01-0039881,201815709,,,,Eriksson,Erin,E,08/17/1979,female,United States,$1100000/$0,$215.28,
06/19/2018,Beacon International,863949,020,00072,ARS-01-0042001,201815708,,,,Nyvoll,Leah,,12/29/2012,female,United States,$60000/$250,$13.26,
06/20/2018,Beacon International,863949,020,00072,ARS-01-0041419,201801548,Passport(482535552),,,Kulla,Brenna,L,03/09/1993,female,United States,$1100000/$250,$12.98,
06/19/2018,Beacon International,863949,020,00072,ARS-01-0041999,201815701,,,,Benetti,Sophia,C,11/30/2000,female,United States,$1100000/$0,$16.25,
06/20/2018,Beacon International,863949,020,00072,ARS-01-0041998,201815700,Passport(AR497613),,,Fontanilla,Maria ,Alejandra,04/23/1989,male,Colombia,$550000/$0,$12.38,
06/19/2018,Beacon International,863949,020,00072,ARS-01-0041995,201815691,,,,Rambatt,Brittany,,11/24/1994,female,United States,$550000/$0,$500.5,
06/25/2018,Beacon International,863949,020,00072,ARS-01-0041992,201815159,Passport(CGXKGKXNX),,,Neuert,Markus,,02/11/1974,male,United States,$60000/$0,$180,
06/26/2018,Beacon America,863949,020,00072,ARS-02-0041991,201815053,Passport(M9472053),,,Bagchi,Amita,,10/17/1953,female,United States,$60000/$1000,$349.2,
06/21/2018,OverseasCare Visitors Insurance Plan,863949,020,00072,OVI-28-0041989,201815051,Passport(R7464155),,,DEVI,BIJENDRI ,,05/03/1958,female,United States,$60000/$250,$277.02,
06/19/2018,Essential America,863949,020,00072,ARS-03-0041539,201802733,Passport(572005689),,,Thorpe,Shelly,Lyn,06/21/1964,female,United States,$5000000/$5000,$1235,
06/18/2018,Beacon International,863949,020,00072,ARS-01-0041982,201813305,,,,SAFI,Mohammad Humayon ,,05/05/1967,male,United States,$550000/$0,$19.25,
06/18/2018,Beacon International,863949,020,00072,ARS-01-0041981,201813304,,,,ZAHIRI,Khatira ,,05/24/1988,male,United States,$550000/$0,$8.44,
06/18/2018,Beacon International,863949,020,00072,ARS-01-0041980,201813302,,,,HANIF,Mohammad Agha ,,08/01/1978,male,United States,$550000/$0,$8.44,
06/18/2018,Beacon International,863949,020,00072,ARS-01-0041979,201813301,,,,ZADRAN,Ajab Noor ,,01/01/1984,male,United States,$550000/$0,$8.44,
06/18/2018,Beacon International,863949,020,00072,ARS-01-0041978,201813300,,,,NADEEB,Safiullah ,,07/20/1972,male,United States,$550000/$0,$12.25,
06/24/2018,Beacon International,863949,020,00072,ARS-01-0041977,201813136,,,,krausz,Adel,H,12/23/1998,female,United States,$550000/$0,$12.38,
06/18/2018,Beacon International,863949,020,00072,ARS-01-0041976,201813057,,,,Orphan,Kelly,,11/13/1969,female,United States,$60000/$250,$78,
06/18/2018,Beacon International,863949,020,00072,ARS-01-0041975,201813056,,,,Buschauer,Alexander,J,02/12/1997,male,United States,$60000/$250,$72.2,
06/19/2018,Beacon International,863949,020,00072,ARS-01-0041973,201813028,,,,Meisels,Baila,,11/22/2017,female,United States,$1100000/$0,$13.75,
06/19/2018,Beacon International,863949,020,00072,ARS-01-0041972,201813027,,,,Schwartz,Bracha,E,02/18/1992,female,United States,$1100000/$0,$14.75,
06/19/2018,Beacon International,863949,020,00072,ARS-01-0041971,201813026,Passport(543036544),,,Meisels,Moshe,D,09/03/1987,male,United States,$1100000/$0,$17.25,
06/18/2018,Essential America,863949,020,00072,ARS-03-0041503,201802547,SSN(394060829),,,David,Alisha,M,05/05/1990,female,United States,$5000000/$2500,$1291,
06/19/2018,Beacon International,863949,020,00072,ARS-01-0041970,201813025,,,,Rao,Xuan,,07/05/1995,female,China,$60000/$250,$6.08,
06/19/2018,Beacon America,863949,020,00072,ARS-02-0035579,201813025,Passport(7291611421),,,Shilnikova,Galina,,07/29/1952,female,United States,$1100000/$2500,$193.2,
06/18/2018,Beacon International,863949,020,00072,ARS-01-0041969,201813024,,,,Loughlin,Juliette,,04/07/1989,female,United States,$1100000/$250,$15.34,
06/18/2018,Beacon International,863949,020,00072,ARS-01-0041968,201813023,,,,Crawford,Robert,,12/17/1988,male,United States,$1100000/$250,$15.34,
06/18/2018,Beacon International,863949,020,00072,ARS-01-0041967,201813021,,,,Suhr,Cheryl,,07/28/1974,female,United States,$550000/$250,$31.36,
06/18/2018,Beacon International,863949,020,00072,ARS-01-0041966,201813020,,,,Foust,Joy,,02/14/1993,female,United States,$60000/$250,$9.88,
06/18/2018,Beacon International,863949,020,00072,ARS-01-0041965,201813019,,,,Foust,Grant,,09/17/1991,male,United States,$60000/$250,$9.88,
06/18/2018,Beacon International,863949,020,00072,ARS-01-0041964,201813018,,,,Foust,Lori,,06/14/1987,female,United States,$60000/$250,$11.7,
06/18/2018,Beacon International,863949,020,00072,ARS-01-0041963,201813017,,,,Foust,Blake,,07/07/1954,male,United States,$60000/$250,$42.25,
06/18/2018,Beacon International,863949,020,00072,ARS-01-0041962,201813016,,,,Foust,Paula,,08/11/1953,female,United States,$60000/$250,$42.25,
06/17/2018,Beacon International,863949,020,00072,ARS-01-0041959,201813004,,,,Sweet,Nicole,M,03/05/1977,female,United States,$110000/$250,$12.6,
06/17/2018,Beacon America,863949,020,00072,ARS-02-0041958,201813003,,,,Goldblatt,Rebecca,L,09/08/1983,female,United States,$60000/$250,$11.48,
06/17/2018,Beacon America,863949,020,00072,ARS-02-0041957,201813002,,,,Atchley,Brian,C,11/30/1983,male,United States,$60000/$250,$11.48,
06/17/2018,Beacon International,863949,020,00072,ARS-01-0041956,201813001,,,,Leung,Fai Kuen,,11/25/1950,male,,$60000/$250,$62.08,
06/17/2018,Beacon International,863949,020,00072,ARS-01-0041955,201813000,,,,Chau,Lai Ping,,09/16/1951,female,,$60000/$250,$62.08,
06/18/2018,Beacon America,863949,020,00072,ARS-02-0041954,201812999,Passport(144127809),,,DROZ FRISCIONI,MARIA BEATRIZ,,09/09/1997,female,Venezuela,$110000/$0,$59.68,
06/17/2018,OverseasCare Visitors Insurance Plan,863949,020,00072,OVI-28-0041953,201812998,,,,Mallesh,Kavya,,11/18/1958,male,United States,$60000/$500,$60.96,