Original Effective Date,Plan Type,Control,Suffix,Account,Policy Number,ID,EE SSN,Dependent SSN,Dependent Relationship,Last Name,First Name,Middle Initial,DOB,Gender,Country,Max/Ded,Premium,
05/31/2018,Beacon International,863949,020,00072,ARS-01-0041529,201802712,,,,Ophir,Elad,,11/21/1987,male,United States,$60000/$250,$20.7,
05/31/2018,Beacon International,863949,020,00072,ARS-01-0041515,201802618,,,,Gauthier,Madeline,M,09/11/1992,female,United States,$1100000/$2500,$9.91,
05/31/2018,Beacon International,863949,020,00072,ARS-01-0041514,201802617,,,,Gauthier,Judith,L,09/09/1962,female,United States,$1100000/$2500,$26.38,
05/31/2018,Beacon International,863949,020,00072,ARS-01-0041513,201802616,,,,Gauthier,Richard,J,04/07/1959,male,United States,$1100000/$2500,$26.38,
05/30/2018,Beacon International,863949,020,00072,ARS-01-0041507,201802587,,,,Shukla,Amitava,,12/11/1985,male,United States,$550000/$250,$16.2,
05/30/2018,Beacon International,863949,020,00072,ARS-01-0041496,201802456,,,,LEWIS,ALLISON,M,03/15/1999,female,United States,$2000000/$250,$36.24,
05/30/2018,Beacon America,863949,020,00072,ARS-02-0041492,201802436,,,,Barnech,Mariana,,07/03/1986,female,Australia,$60000/$250,$114.8,
05/30/2018,Beacon International,863949,020,00072,ARS-01-0041491,201802435,,,,Triegaardt,Adriana,,04/16/1934,female,Zimbabwe,$12000/$250,$129,
05/31/2018,Beacon America,863949,020,00072,ARS-02-0041485,201802172,Passport(N1975648),,,Bhargava,Lakshman ,K,11/27/1947,male,United States,$50000/$100,$1227.6,
05/31/2018,Beacon America,863949,020,00072,ARS-02-0041484,201802171,Passport(N1975371),,,Bhargava,Manju,,07/23/1955,female,United States,$60000/$100,$767.25,
05/29/2018,Beacon America,863949,020,00072,ARS-02-0041463,201802105,Passport(E24687754),,,Zhou,Zixuan,,04/19/2000,female,United States Minor,$60000/$500,$563.09,
05/29/2018,Beacon International,863949,020,00072,ARS-01-0041458,201802098,,,,Bell,Horace,J,11/13/1951,male,United States,$60000/$250,$93.12,
05/29/2018,Beacon International,863949,020,00072,ARS-01-0041457,201802097,,,,Bell,Pamala,H,06/16/1953,female,United States,$60000/$250,$78,
05/29/2018,Beacon International,863949,020,00072,ARS-01-0041452,201801836,,,,Strom,Summer,,10/06/2000,female,United States,$1100000/$250,$28.6,
05/29/2018,Beacon International,863949,020,00072,ARS-01-0041451,201801835,,,,Forbes,Aravel,,05/04/1964,female,United States,$1100000/$250,$81.64,
05/30/2018,Beacon International,863949,020,00072,ARS-01-0041449,201801833,Passport(485504980),,,Horvath,Courtney,N,01/08/1992,female,United States,$1100000/$0,$55.61,
05/30/2018,Beacon International,863949,020,00072,ARS-01-0041448,201801832,Passport(582361791),,,Zimmerman,Zachary,T,12/06/1986,male,United States,$1100000/$0,$65.04,
05/28/2018,Beacon America,863949,020,00072,ARS-02-0041447,201801831,,,,kuppuswamy,balasubramanyam,,06/01/1955,male,United States,$550000/$1000,$644,
05/28/2018,Beacon America,863949,020,00072,ARS-02-0041446,201801830,,,,balasubramanyam,krishna kumari,,07/15/1963,female,United States,$550000/$1000,$518.88,
05/29/2018,Beacon International,863949,020,00072,ARS-01-0041445,201801829,,,,French,Erin,,12/06/1982,female,United States,$1100000/$0,$8.63,
05/29/2018,Beacon America,863949,020,00072,ARS-02-0041444,201801828,Passport(024165453),,,Hernandez Velazco,Laura,A,02/09/1987,female,Venezuela,$60000/$0,$65.6,
05/29/2018,Beacon International,863949,020,00072,ARS-01-0041443,201801827,Passport(503570192),,,moreno,paola,C,03/12/1994,female,United States,$60000/$0,$97.57,
05/28/2018,Beacon America,863949,020,00072,ARS-02-0041442,201801573,Passport(M2170163),,,Gopinath,Thilagam,,04/05/1960,female,United States,$110000/$500,$717.23,
05/28/2018,Beacon International,863949,020,00072,ARS-01-0041439,201801568,,,,Weger,Heidi,,07/16/1966,female,United States,$550000/$250,$49.28,
05/28/2018,Beacon International,863949,020,00072,ARS-01-0041438,201801567,,,,Snell,Gretchen,,05/15/1962,female,United States,$550000/$250,$49.28,
05/29/2018,Beacon America,863949,020,00072,ARS-02-0041435,201801564,,,,Sundaresan,Rukmani,,11/07/1945,female,United States,$50000/$2500,$927.36,
05/29/2018,Beacon America,863949,020,00072,ARS-02-0041434,201801563,Passport(K5822268),,,Natesa,Sundaresan,,05/03/1942,male,United States,$50000/$2500,$927.36,
05/28/2018,Beacon International,863949,020,00072,ARS-01-0041433,201801562,,,,Henderson,Andre,D,12/06/1986,male,United States,$60000/$250,$7.2,
05/28/2018,Beacon International,863949,020,00072,ARS-01-0041431,201801560,Passport(547747989),,,Scoon,Caleb,,05/14/1997,male,United States,$2000000/$0,$28.7,
05/28/2018,Beacon International,863949,020,00072,ARS-01-0041430,201801559,,,,Balaji,Sujala,,06/15/1982,female,Canada,$60000/$250,$10.8,
05/29/2018,Beacon International,863949,020,00072,ARS-01-0041429,201801558,,,,Kidane,Ruta,A,06/29/1981,female,Eritrea,$60000/$250,$5.4,
05/28/2018,Beacon International,863949,020,00072,ARS-01-0041427,201801556,,,,Gautier,Pierre-Richard,,01/28/1991,male,United States,$60000/$250,$6.84,
05/28/2018,Beacon International,863949,020,00072,ARS-01-0041426,201801555,,,,Nwulu,Chika,,03/30/1987,male,United States,$60000/$250,$8.1,
05/28/2018,OverseasCare Visitors Insurance Plan,863949,020,00072,OVI-28-0041425,201801554,Passport(P4208329),,,Kaviraj Ramaya Ganesa,Sattanathan,,04/09/1956,male,United States,$60000/$100,$295.16,
05/31/2018,Beacon International,863949,020,00072,ARS-01-0041424,201801553,,,,Kobrick,Ryan,,11/05/1979,male,United States,$60000/$250,$61.2,
05/31/2018,Beacon International,863949,020,00072,ARS-01-0041423,201801552,,,,Kobrick,Jen,,06/25/1986,female,United States,$60000/$250,$61.2,
05/31/2018,Beacon International,863949,020,00072,ARS-01-0041422,201801551,,,,Kobrick,Rafael,,07/16/2015,male,United States,$60000/$250,$47.6,
05/29/2018,OverseasCare Visitors Insurance Plan,863949,020,00072,OVI-28-0041421,201801550,Passport(J7863016),,,Dindukurthi,Muddu Rangaiah,,12/18/1943,male,United States,$110000/$250,$239.2,
05/27/2018,Beacon International,863949,020,00072,ARS-01-0041419,201801548,Passport(482535552),,,Kulla,Brenna,L,03/09/1993,female,United States,$1100000/$250,$11.8,
05/27/2018,Beacon International,863949,020,00072,ARS-01-0041418,201801547,,,,Hair,Karen,H,12/21/1953,female,United States,$60000/$250,$48.75,
05/27/2018,Beacon International,863949,020,00072,ARS-01-0041414,201801534,,,,Kim,Sukhwan,,06/11/1981,male,United States,$110000/$0,$8.1,
05/27/2018,Beacon International,863949,020,00072,ARS-01-0041413,201801533,,,,Kim,Kyoungeun,,12/11/1982,female,United States,$110000/$0,$8.1,
05/27/2018,Beacon International,863949,020,00072,ARS-01-0041410,201801530,,,,Feldman,Richard,A,01/14/1960,male,United States,$1100000/$250,$28.26,
05/26/2018,Beacon America,863949,020,00072,ARS-02-0041409,201801318,,,,Lopez,Aaron,S,11/10/1980,male,United States,$60000/$250,$8.2,
05/26/2018,Beacon International,863949,020,00072,ARS-01-0041407,201801315,,,,Goldstein,Maurice,,04/08/1987,male,United States,$60000/$250,$10.8,
05/26/2018,Beacon International,863949,020,00072,ARS-01-0041406,201801314,,,,Stampler,Laura,A,12/22/1987,female,United States,$60000/$250,$10.8,
05/30/2018,Beacon America,863949,020,00072,ARS-02-0041405,201801313,Passport(AP0063411),,,Magkini,Souzana,L,12/23/1990,female,United States,$1100000/$500,$66.4,
05/27/2018,Beacon America,863949,020,00072,ARS-02-0041191,201830231,,,,Barrie,Chelsea,,10/19/1986,female,Canada,$1100000/$500,$13.59,
05/27/2018,Beacon International,863949,020,00072,ARS-01-0041403,201801311,,,,GARCIA,ULISES,,09/09/1979,male,Mexico,$60000/$250,$13.5,
05/26/2018,Beacon America,863949,020,00072,ARS-02-0041402,201801310,,,,Livingston Brewley,Dawn,M,09/30/1969,female,,$110000/$250,$95.36,
05/26/2018,Beacon America,863949,020,00072,ARS-02-0041401,201801309,,,,Brewley,Creightlyn,M,12/02/1996,female,,$110000/$250,$49.28,
05/26/2018,Beacon International,863949,020,00072,ARS-01-0041400,201801308,,,,Shafer,Benjamin,,01/04/1989,male,United States,$60000/$0,$4.75,
05/26/2018,Beacon International,863949,020,00072,ARS-01-0041399,201801307,,,,MWAI,DAN,T,09/26/1988,male,United States,$60000/$250,$43.32,
05/27/2018,Beacon International,863949,020,00072,ARS-01-0041398,201801306,,,,Riquelme Valle,Christian,J,10/14/2002,male,Puerto Rico,$60000/$0,$7,
05/27/2018,Beacon International,863949,020,00072,ARS-01-0041397,201801305,,,,Valle Aviles,Nancy,,11/18/1972,female,Puerto Rico,$60000/$0,$15,
05/27/2018,Beacon International,863949,020,00072,ARS-01-0041396,201801304,,,,Riquelme Rodriguez,Javier,,10/26/1971,male,Puerto Rico,$60000/$0,$15,
05/25/2018,Beacon America,863949,020,00072,ARS-02-0041386,201801213,,,,Buckle,Ademola,,11/03/1952,male,Sierra Leone,$60000/$2500,$262.08,
05/31/2018,Beacon International,863949,020,00072,ARS-01-0041383,201801210,Passport(125268482),,,Parnes,hannah,,02/07/1932,male,United States,$12000/$0,$282.19,
05/25/2018,Beacon International,863949,020,00072,ARS-01-0041382,201801209,,,,Semenova,Natalia,,08/15/1989,female,Canada,$60000/$0,$9.88,
05/25/2018,Beacon International,863949,020,00072,ARS-01-0041381,201801208,,,,Semenov,Yulian,,07/04/1986,male,Canada,$60000/$0,$11.7,
05/30/2018,Beacon International,863949,020,00072,ARS-01-0041380,201801207,Passport(539835450),,,Voth,Wyatt,,08/08/1999,male,United States,$1100000/$0,$30.98,
05/25/2018,Beacon America,863949,020,00072,ARS-02-0041365,201801192,,,,NEUFELD,ANGELIQUE,,07/09/2012,female,United States,$60000/$250,$6.15,
05/26/2018,Beacon International,863949,020,00072,ARS-01-0041364,201801191,,,,Zhang,Yuan,,07/21/1972,female,Canada,$1100000/$100,$30.8,
05/24/2018,Beacon America,863949,020,00072,ARS-02-0041363,201801190,,,,schulman,adina,,03/28/2006,male,United States,$110000/$0,$8.75,
05/24/2018,Beacon America,863949,020,00072,ARS-02-0041362,201801189,,,,schulman,yitzchok,,02/05/2004,male,United States,$110000/$0,$8.75,
05/24/2018,Beacon America,863949,020,00072,ARS-02-0041361,201801188,,,,schulman,aliza,,08/02/2002,male,United States,$110000/$0,$8.75,
05/24/2018,Beacon America,863949,020,00072,ARS-02-0041360,201801187,,,,schulman,eliyahu,,11/19/1996,male,United States,$110000/$0,$9.63,
05/24/2018,Beacon America,863949,020,00072,ARS-02-0041359,201801186,,,,schulman,ahuva,,03/19/1965,male,United States,$110000/$0,$28.63,
05/24/2018,Beacon America,863949,020,00072,ARS-02-0041358,201801185,,,,schulman,avi,,11/09/1961,male,United States,$110000/$0,$28.63,
05/31/2018,Beacon International,863949,020,00072,ARS-01-0041357,201801184,,,,Gutierrez Bola&ntilde;os,Jochebed,,11/17/1992,female,Mexico,$60000/$250,$9.12,
05/31/2018,Beacon International,863949,020,00072,ARS-01-0041356,201801182,,,,Novelo Ibarra,Marco,A,03/03/1994,male,Mexico,$60000/$250,$9.12,
05/24/2018,Beacon America,863949,020,00072,ARS-02-0041355,201801028,,,,sharma,shakun,,08/21/1994,female,United States,$60000/$1000,$36.7,
05/24/2018,Beacon America,863949,020,00072,ARS-02-0041354,201801027,Passport(p7672986),,,sharma,parveen,,09/25/1949,female,United States,$60000/$1000,$153.92,
05/26/2018,Beacon International,863949,020,00072,ARS-01-0041352,201800890,,,,Oqbu,Nazriet,M,01/01/1978,female,Eritrea,$60000/$250,$16.5,
05/30/2018,OverseasCare Visitors Insurance Plan,863949,020,00072,OVI-28-0041347,201800885,Passport(K8357985),,,Sumangala,FNU,,01/01/1958,female,United States,$60000/$250,$76.95,
05/30/2018,OverseasCare Visitors Insurance Plan,863949,020,00072,OVI-28-0041346,201800884,Passport(K8357985),,,Mallikarjun,FNU,,01/06/1955,male,United States,$60000/$250,$76.95,
05/25/2018,Beacon International,863949,020,00072,ARS-01-0041345,201800883,Passport(507044391),,,MAJMUDAR,STUTI,,07/22/1986,female,United States,$60000/$0,$16.88,
05/28/2018,Beacon International,863949,020,00072,ARS-01-0041340,201811282,,,,Tekeste,Essey,M,01/01/1988,male,Eritrea,$60000/$250,$9,
05/28/2018,Beacon International,863949,020,00072,ARS-01-0041339,201833817,,,,Tekesete,Essey,M,01/01/1988,male,Eritrea,$60000/$250,$9,
05/28/2018,Beacon International,863949,020,00072,ARS-01-0041338,201863739,,,,Kesete,Essey,M,01/01/1988,female,Eritrea,$60000/$250,$9,
05/23/2018,Beacon America,863949,020,00072,ARS-02-0041314,201880897,,,,Klein ,Saindy,,05/13/1997,female,Canada,$60000/$500,$69.19,
05/23/2018,Beacon International,863949,020,00072,ARS-01-0041283,201829311,,,,Waknin,Chana,,12/20/1972,female,United States,$2000000/$0,$29.8,
05/23/2018,Essential America,863949,020,00072,ARS-03-0041176,201810737,Passport(534847042),,,Blanshan,June,Marie,08/30/1964,female,United States,$5000000/$1000,$1675,
05/27/2018,Beacon International,863949,020,00072,ARS-01-0041282,201857795,,,,Han,Naeun,,04/14/1997,female,Canada,$60000/$250,$7.6,
05/27/2018,Beacon International,863949,020,00072,ARS-01-0041281,201828159,,,,Yang,Jimin,,10/28/1990,female,Canada,$60000/$250,$7.6,
05/27/2018,Beacon International,863949,020,00072,ARS-01-0041280,201819904,,,,Jeon,Jaejoon,,01/31/1978,male,Canada,$60000/$250,$15,
05/27/2018,Beacon International,863949,020,00072,ARS-01-0041279,201826566,,,,Nam,Handong,,11/17/1987,male,Canada,$60000/$250,$9,
05/27/2018,Beacon International,863949,020,00072,ARS-01-0041278,201872165,,,,Lee,Yangmoo,,10/11/1966,male,Canada,$60000/$250,$26,
05/27/2018,Beacon International,863949,020,00072,ARS-01-0041277,201837320,,,,Cho,Kuem Ra,,12/15/1964,female,Canada,$60000/$250,$26,
05/23/2018,Essential America,863949,020,00072,ARS-03-0041178,201824025,Passport(467700304),,,Swart,Tammy,Lyn,10/17/1963,female,United States,$5000000/$5000,$1235,
05/27/2018,Beacon International,863949,020,00072,ARS-01-0041270,201836380,,,,Kim,Suh hee,,10/29/1992,female,Canada,$60000/$250,$7.6,
05/27/2018,Beacon International,863949,020,00072,ARS-01-0041269,201854539,,,,Park,Hannah,,02/21/1991,female,Canada,$60000/$250,$7.6,
05/27/2018,Beacon International,863949,020,00072,ARS-01-0041268,201812541,,,,Lee,Sangwoo,,08/30/1990,male,Canada,$60000/$250,$7.6,
05/27/2018,Beacon International,863949,020,00072,ARS-01-0041267,201868466,,,,Bae,Jin seob,,07/14/1962,male,Canada,$60000/$250,$26,
05/23/2018,Beacon International,863949,020,00072,ARS-01-0041260,201817111,,,,Mickus,Spencer,D,03/28/1998,male,United States,$60000/$500,$10.26,
05/23/2018,Beacon International,863949,020,00072,ARS-01-0041259,201877502,,,,Mickus,Jessalyn,A,05/23/2002,female,United States,$60000/$500,$9.45,
05/23/2018,Beacon International,863949,020,00072,ARS-01-0041258,201882152,,,,Mickus,Laina,L,05/17/1967,female,United States,$60000/$500,$35.1,
05/24/2018,Beacon America,863949,020,00072,ARS-02-0041255,201858423,Passport(126919619),,,GARCIA GORRIN,YOLIMAR ALEJANDRA ,,12/11/1985,female,Venezuela,$110000/$0,$23.4,
05/24/2018,Beacon America,863949,020,00072,ARS-02-0041254,201837114,,,,SALAZAR BELMONTE,ADRIANA LUCILA,,06/28/1975,female,Venezuela,$60000/$0,$27.56,
05/23/2018,Beacon America,863949,020,00072,ARS-02-0041253,201890386,Passport(P547535),,,pestana da silva,maria ,z,12/24/1950,female,United States,$1100000/$1000,$161.92,
05/25/2018,Beacon International,863949,020,00072,ARS-01-0041252,201899337,Passport(142582853),,,GUZMAN,DORIANNYS MARIANA,,12/26/1988,female,Venezuela,$1100000/$100,$112.93,
05/23/2018,Clear America,863949,020,00072,ARS-05-0041075,201874684,Passport(TA355534),,,Tang,Jaimie,,06/15/1982,female,Trinidad And Tobago,$2000000/$10000,$1028.7,
05/22/2018,Beacon International,863949,020,00072,ARS-01-0041249,201819545,,,,Breuer ,Chana ,,11/10/1954,female,United States,$60000/$0,$40.63,
05/22/2018,Beacon America,863949,020,00072,ARS-02-0041243,201839624,,,,Sokamte,Adonis,,02/04/1956,male,United States,$60000/$250,$139.5,
05/22/2018,Beacon International,863949,020,00072,ARS-01-0041241,201840446,,,,Weinberg,Avrohom,M,11/26/1991,male,United States,$60000/$250,$13.68,
05/22/2018,Beacon International,863949,020,00072,ARS-01-0041240,201825273,,,,Craig,Glen,,11/07/1970,male,United States,$550000/$250,$21.56,
05/22/2018,Beacon International,863949,020,00072,ARS-01-0041239,201894349,,,,Lindsey,Brian,,07/22/1971,male,United States,$550000/$250,$21.56,
05/23/2018,Beacon America,863949,020,00072,ARS-02-0041236,201826425,Passport(AU747562),,,PARADA ACEROS,SANDRA MARCELA,,05/19/1963,female,Colombia,$60000/$0,$198,
05/23/2018,Beacon International,863949,020,00072,ARS-01-0041235,201854440,,,,Sayers,Caroline,,04/23/1979,female,United States,$60000/$250,$5.85,
05/25/2018,Beacon International,863949,020,00072,ARS-01-0041234,201857922,Passport(580767065),,,Poynter,Jazmyn,R,04/28/2000,female,United States,$110000/$0,$15.44,
05/28/2018,Beacon International,863949,020,00072,ARS-01-0041233,201808264,,,,Skrobynets,Marianna,Y,12/02/1997,female,United States,$60000/$0,$6.65,
05/21/2018,Enhanced America,863949,020,00072,ARS-04-0041207,201824854,Passport(LH883888),,,Hersom,Aarron,,07/19/1979,male,New Zealand,$5000000/$500,$1794,
05/23/2018,Beacon America,863949,020,00072,ARS-02-0041228,201871058,,,,PARMAR,MAMTABAHEN,,05/06/1965,female,United States,$60000/$2500,$337.68,
05/23/2018,Beacon America,863949,020,00072,ARS-02-0041227,201807716,Passport(H3934969),,,PARMAR,ASHOKKUMAR,,04/06/1952,male,United States,$60000/$2500,$487.76,
05/23/2018,OverseasCare Visitors Insurance Plan,863949,020,00072,OVI-28-0041226,201823425,Passport(K6307501),,,Mehta,Neeta,Deepak,06/22/1964,female,India,$60000/$100,$79.56,
05/23/2018,OverseasCare Visitors Insurance Plan,863949,020,00072,OVI-28-0041225,201847807,Passport(K6307501),,,Mehta,Deepak,Manilal,07/21/1962,male,India,$60000/$100,$79.56,
05/21/2018,Beacon International,863949,020,00072,ARS-01-0041224,201805088,,,,Gonzalez,Jessica,M,10/22/1993,female,United States,$550000/$0,$25.03,
05/22/2018,OverseasCare Visitors Insurance Plan,863949,020,00072,OVI-28-0041223,201840977,Passport(H4881093),,,Arora,Mridula,,09/07/1957,female,United States,$60000/$100,$297.04,
05/31/2018,Essential America,863949,020,00072,ARS-03-0041187,201886772,Passport(N06341711),,,Yermekbayev,Aidar,,06/17/1975,male,United States,$5000000/$1000,$866,
05/31/2018,Essential America,863949,020,00072,ARS-03-0041187,201864442,,Passport(N08505995),Spouse,Yermekbayeva,Aliya,,11/02/1977,female,United States,$5000000/$1000,$1818,
05/31/2018,Essential America,863949,020,00072,ARS-03-0041187,201899021,,Passport(N09346356),Dependant,Yermekbayev,Abylkhaiyr,,04/24/2003,male,United States,$5000000/$1000,$442,
05/31/2018,Essential America,863949,020,00072,ARS-03-0041187,201893940,,Passport(N09346358),Dependant,Yermekbayev,Aubakir,,08/05/2006,male,United States,$5000000/$1000,$442,
05/31/2018,Essential America,863949,020,00072,ARS-03-0041187,201831145,,Passport(N09996146),Dependant,Yermekbayev,Ansar,,03/28/2014,male,United States,$5000000/$1000,$0,
05/21/2018,Beacon International,863949,020,00072,ARS-01-0041222,201844961,,,,Williams,Shalisha,,02/05/1989,female,United States,$60000/$250,$5.32,
05/21/2018,Beacon International,863949,020,00072,ARS-01-0041220,201898909,,,,Teiro,Kristina,N,01/01/1988,female,United States,$1100000/$500,$8.07,
05/23/2018,Beacon America,863949,020,00072,ARS-02-0040833,201898195,,,,Barreto,Katia,,12/22/1953,female,Brazil,$110000/$100,$83.66,
05/26/2018,OverseasCare Visitors Insurance Plan,863949,020,00072,OVI-28-0041219,201833921,Passport(L5886609),,,sarda,sunil,,10/20/1955,male,United States,$110000/$100,$162.14,
05/23/2018,OverseasCare Visitors Insurance Plan,863949,020,00072,OVI-28-0041218,201801964,Passport(K9004610),,,KATOCH,SHASHI,KIRAN,03/01/1955,female,United States,$60000/$250,$224.01,
05/21/2018,Beacon International,863949,020,00072,ARS-01-0041217,201861260,,,,swerdlow,trevor,,06/26/1951,male,United States,$1100000/$250,$40.8,
05/31/2018,OverseasCare Visitors Insurance Plan,863949,020,00072,OVI-28-0041216,201898211,Passport(H6567563),,,Suryadevara,Jyothi,,07/10/1954,female,United States,$60000/$500,$187.88,
05/31/2018,OverseasCare Visitors Insurance Plan,863949,020,00072,OVI-28-0041215,201868426,Passport(H6567563),,,Suryadevara,Ramarao,,07/04/1946,male,United States,$60000/$500,$247.66,
05/20/2018,OverseasCare Visitors Insurance Plan,863949,020,00072,OVI-28-0041214,201897868,Passport(P3003087),,,Shrikhande,Jai,,01/14/1948,female,United States,$110000/$250,$462.8,
05/20/2018,OverseasCare Visitors Insurance Plan,863949,020,00072,OVI-28-0041213,201818638,Passport(P3003087),,,Shrikhande,Vishram,M,02/14/1944,male,United States,$110000/$250,$462.8,
05/23/2018,OverseasCare Visitors Insurance Plan,863949,020,00072,OVI-28-0041211,201888914,Passport(H3554716),,,Bhatkar,Vishnu,A,02/27/1946,male,United States,$60000/$500,$129.92,
05/23/2018,OverseasCare Visitors Insurance Plan,863949,020,00072,OVI-28-0041210,201838747,Passport(H3554716),,,Atmaram,Shashikant,Bhatkar,04/07/1942,male,United States,$60000/$500,$129.92,
05/20/2018,Beacon International,863949,020,00072,ARS-01-0041209,201808201,,,,Kirby,Jeffrey,A,07/01/1975,male,United States,$550000/$100,$47.43,
05/19/2018,Beacon America,863949,020,00072,ARS-02-0041208,201861553,,,,Lopez,Aaron,S,11/10/1980,male,United States,$60000/$250,$8.2,
05/20/2018,Beacon America,863949,020,00072,ARS-02-0041206,201803886,,,,Chen,Jiaxi,,01/27/2011,male,China,$60000/$1000,$168.36,
05/20/2018,Beacon America,863949,020,00072,ARS-02-0041205,201811559,,,,Chen,Yenan,,09/13/2004,female,China,$60000/$1000,$168.36,
05/20/2018,Beacon America,863949,020,00072,ARS-02-0041204,201829767,Passport(EA3112069),,,Chen,Jianzhao ,,07/24/1979,male,China,$60000/$1000,$240.1,
05/30/2018,Beacon International,863949,020,00072,ARS-01-0041202,201853738,,,,Ghirmatsion,Zaid,T,02/28/1983,female,Eritrea,$60000/$250,$9.9,
05/29/2018,Beacon America,863949,020,00072,ARS-02-0041201,201855545,Passport(L7039856),,,Doreswamy,Pramila,,01/11/1943,female,United States,$50000/$500,$576.72,
05/19/2018,Beacon America,863949,020,00072,ARS-02-0041200,201870927,,,,Smith,Austin,L,12/20/2000,male,United States,$60000/$0,$7.69,
05/19/2018,Beacon International,863949,020,00072,ARS-01-0041197,201832916,,,,Ateeq,Rehana,,04/16/1967,female,Australia,$60000/$250,$13,
05/19/2018,Beacon International,863949,020,00072,ARS-01-0041196,201820398,,,,Hussain,Syed,A,09/17/1966,male,Australia,$60000/$250,$13,
05/18/2018,Beacon America,863949,020,00072,ARS-02-0041191,201830231,,,,Barrie,Chelsea,,10/19/1986,female,Canada,$1100000/$500,$24.46,
05/21/2018,Beacon International,863949,020,00072,ARS-01-0041189,201848409,Passport(580411603),,,Wood,William,Russell,10/16/1976,male,United States,$110000/$0,$27,
05/19/2018,Beacon International,863949,020,00072,ARS-01-0041188,201876025,Passport(A6027784),,,BARNES,FRANK,,05/08/1967,male,Trinidad And Tobago,$60000/$0,$16.25,
05/21/2018,Beacon America,863949,020,00072,ARS-02-0041186,201807884,,,,Limaye,MEENA,govind,06/02/1956,male,United States,$550000/$2500,$857.5,
05/21/2018,Beacon America,863949,020,00072,ARS-02-0041185,201842083,Passport(M2538074),,,Limaye,Govind,R,07/27/1950,male,United States,$550000/$2500,$937.12,
05/26/2018,Beacon International,863949,020,00072,ARS-01-0041184,201850317,,,,Bernard,Andrew,,05/25/1994,male,United States,$60000/$0,$14.25,
05/26/2018,Beacon International,863949,020,00072,ARS-01-0041183,201889722,,,,Ek,Roy,,06/02/1981,male,United States,$60000/$0,$16.88,
05/18/2018,Beacon International,863949,020,00072,ARS-01-0041180,201866175,,,,Snyder,Gittle,,05/03/1996,female,United States,$2000000/$0,$24.6,
05/18/2018,Beacon America,863949,020,00072,ARS-02-0041174,201845093,,,,Wilson,Joshua,,09/23/1990,male,United States,$60000/$250,$6.2,
05/31/2018,Beacon International,863949,020,00072,ARS-01-0041172,201857211,,,,uribe,maricella,,08/15/1991,female,United States,$110000/$250,$88.35,
05/17/2018,Beacon International,863949,020,00072,ARS-01-0041171,201892959,,,,Fireman,Rochel,,11/18/2017,female,United States,$550000/$0,$7.5,
05/17/2018,Beacon International,863949,020,00072,ARS-01-0041170,201811899,,,,Fireman,Sara,M,07/01/1995,female,United States,$550000/$0,$8.25,
05/17/2018,Beacon International,863949,020,00072,ARS-01-0041169,201841224,,,,Fireman,Naftali,,09/01/1990,male,United States,$550000/$0,$8.25,
05/21/2018,Beacon International,863949,020,00072,ARS-01-0040392,201817273,,,,Lunday,Kyle,,09/19/1985,male,United States,$60000/$250,$9.9,