Original Effective Date,Plan Type,Control,Suffix,Account,Policy Number,ID,EE SSN,Dependent SSN,Dependent Relationship,Last Name,First Name,Middle Initial,DOB,Gender,Country,Max/Ded,Premium,
05/21/2018,Beacon International,863949,020,00072,ARS-01-0041222,201844961,,,,Williams,Shalisha,,02/05/1989,female,United States,$60000/$250,$5.32,
05/21/2018,Beacon International,863949,020,00072,ARS-01-0041220,201898909,,,,Teiro,Kristina,N,01/01/1988,female,United States,$1100000/$500,$8.07,
05/21/2018,Beacon International,863949,020,00072,ARS-01-0041217,201861260,,,,swerdlow,trevor,,06/26/1951,male,United States,$1100000/$250,$40.8,
05/20/2018,OverseasCare Visitors Insurance Plan,863949,020,00072,OVI-28-0041214,201897868,Passport(P3003087),,,Shrikhande,Jai,,01/14/1948,female,United States,$110000/$250,$462.8,
05/20/2018,OverseasCare Visitors Insurance Plan,863949,020,00072,OVI-28-0041213,201818638,Passport(P3003087),,,Shrikhande,Vishram,M,02/14/1944,male,United States,$110000/$250,$462.8,
05/20/2018,Beacon International,863949,020,00072,ARS-01-0041209,201808201,,,,Kirby,Jeffrey,A,07/01/1975,male,United States,$550000/$100,$47.43,
05/19/2018,Beacon America,863949,020,00072,ARS-02-0041208,201861553,,,,Lopez,Aaron,S,11/10/1980,male,United States,$60000/$250,$8.2,
05/20/2018,Beacon America,863949,020,00072,ARS-02-0041206,201803886,,,,Chen,Jiaxi,,01/27/2011,male,China,$60000/$1000,$168.36,
05/20/2018,Beacon America,863949,020,00072,ARS-02-0041205,201811559,,,,Chen,Yenan,,09/13/2004,female,China,$60000/$1000,$168.36,
05/20/2018,Beacon America,863949,020,00072,ARS-02-0041204,201829767,Passport(EA3112069),,,Chen,Jianzhao ,,07/24/1979,male,China,$60000/$1000,$240.1,
05/19/2018,Beacon America,863949,020,00072,ARS-02-0041200,201870927,,,,Smith,Austin,L,12/20/2000,male,United States,$60000/$0,$7.69,
05/19/2018,Beacon International,863949,020,00072,ARS-01-0041197,201832916,,,,Ateeq,Rehana,,04/16/1967,female,Australia,$60000/$250,$13,
05/19/2018,Beacon International,863949,020,00072,ARS-01-0041196,201820398,,,,Hussain,Syed,A,09/17/1966,male,Australia,$60000/$250,$13,
05/18/2018,Beacon America,863949,020,00072,ARS-02-0041191,201830231,,,,Barrie,Chelsea,,10/19/1986,female,Canada,$1100000/$500,$24.46,
05/21/2018,Beacon International,863949,020,00072,ARS-01-0041189,201848409,Passport(580411603),,,Wood,William,Russell,10/16/1976,male,United States,$110000/$0,$27,
05/19/2018,Beacon International,863949,020,00072,ARS-01-0041188,201876025,Passport(A6027784),,,BARNES,FRANK,,05/08/1967,male,Trinidad And Tobago,$60000/$0,$16.25,
05/21/2018,Beacon America,863949,020,00072,ARS-02-0041186,201807884,,,,Limaye,MEENA,govind,06/02/1956,male,United States,$550000/$2500,$857.5,
05/21/2018,Beacon America,863949,020,00072,ARS-02-0041185,201842083,Passport(M2538074),,,Limaye,Govind,R,07/27/1950,male,United States,$550000/$2500,$937.12,
05/18/2018,Beacon International,863949,020,00072,ARS-01-0041180,201866175,,,,Snyder,Gittle,,05/03/1996,female,United States,$2000000/$0,$24.6,
05/18/2018,Beacon America,863949,020,00072,ARS-02-0041174,201845093,,,,Wilson,Joshua,,09/23/1990,male,United States,$60000/$250,$6.2,
05/17/2018,Beacon International,863949,020,00072,ARS-01-0041171,201892959,,,,Fireman,Rochel,,11/18/2017,female,United States,$550000/$0,$7.5,
05/17/2018,Beacon International,863949,020,00072,ARS-01-0041170,201811899,,,,Fireman,Sara,M,07/01/1995,female,United States,$550000/$0,$8.25,
05/17/2018,Beacon International,863949,020,00072,ARS-01-0041169,201841224,,,,Fireman,Naftali,,09/01/1990,male,United States,$550000/$0,$8.25,
05/21/2018,Beacon International,863949,020,00072,ARS-01-0040392,201817273,,,,Lunday,Kyle,,09/19/1985,male,United States,$60000/$250,$9.9,
05/18/2018,Essential America,863949,020,00072,ARS-03-0041137,201825905,Passport(FV344323),,,GARCIA TEIXEIRA,LARA,,02/26/2013,female,United States,$5000000/$500,$512,
05/18/2018,Beacon America,863949,020,00072,ARS-02-0041165,201823639,,,,Gestetner,Arohom Y,,01/29/2018,male,United States,$1100000/$0,$14.06,
05/17/2018,Beacon International,863949,020,00072,ARS-01-0041157,201882888,,,,Anderson,Tricia,,12/12/1986,female,United States,$60000/$250,$19.8,
05/17/2018,Beacon International,863949,020,00072,ARS-01-0041148,201856901,,,,Abreu,Vilma,L,05/17/1959,female,United States,$60000/$250,$28.6,
05/17/2018,Beacon International,863949,020,00072,ARS-01-0041147,201818778,,,,Abreu,jossie,E,03/01/1959,male,United States,$60000/$250,$28.6,
05/19/2018,Beacon America,863949,020,00072,ARS-02-0035579,201827279,Passport(7291611421),,,Shilnikova,Galina,,07/29/1952,female,United States,$1100000/$2500,$199.64,
05/17/2018,Beacon International,863949,020,00072,ARS-01-0041134,201898590,,,,Schnell,Bailey ,R,05/28/1997,female,United States,$60000/$2500,$5.85,
05/17/2018,Beacon International,863949,020,00072,ARS-01-0041128,201807949,,,,Zahniser,Benjamin,,04/13/1998,male,United States,$60000/$250,$14.44,
05/17/2018,Beacon International,863949,020,00072,ARS-01-0041127,201886403,,,,Zahniser,Dana,,10/04/1966,female,United States,$60000/$250,$49.4,
05/17/2018,Beacon International,863949,020,00072,ARS-01-0041126,201870717,,,,Zahniser,Terry,,01/24/1960,male,United States,$60000/$250,$49.4,
05/17/2018,Beacon International,863949,020,00072,ARS-01-0041125,201877611,,,,Rahemtulla,Rahim,,06/14/1977,male,United States,$60000/$250,$18,
05/17/2018,Beacon America,863949,020,00072,ARS-02-0041124,201852382,Passport(Z2126805),,,Tummala,Vamsi Krishna,,08/16/1981,male,United States,$550000/$0,$322.5,
05/18/2018,Beacon America,863949,020,00072,ARS-02-0041114,201857542,,,,Vaculikova,Jana,,09/17/1987,female,Czech Republic,$60000/$250,$8.2,
05/17/2018,Beacon America,863949,020,00072,ARS-02-0041104,201856501,,,,L,Alexander ,Fecowycz,03/04/2017,male,Canada,$60000/$250,$119.6,
05/17/2018,Beacon America,863949,020,00072,ARS-02-0041103,201854372,,,,Levin,Marina,,03/14/1984,female,Canada,$60000/$250,$221.73,
05/21/2018,Beacon International,863949,020,00072,ARS-01-0041102,201823924,,,,Bolo,Tchaa,,02/21/1970,male,Togo,$60000/$250,$10.5,
05/16/2018,Beacon International,863949,020,00072,ARS-01-0041082,201865773,,,,Delacerda,Luis,G,12/01/1965,male,United States,$1100000/$0,$54.95,
05/16/2018,Beacon International,863949,020,00072,ARS-01-0041081,201897563,,,,Lepe,Gema,L,07/18/1971,female,United States,$1100000/$0,$35,
05/16/2018,Beacon International,863949,020,00072,ARS-01-0041080,201819966,Passport(801080272),,,Valera Rojas,John Adalberto,M,12/27/1968,male,Colombia,$2000000/$0,$40.98,
05/16/2018,Beacon International,863949,020,00072,ARS-01-0041077,201884133,,,,Segreto,Alessandra,,11/03/1987,female,United States,$60000/$250,$4.5,
05/16/2018,Beacon International,863949,020,00072,ARS-01-0041076,201869696,,,,Sabel,Andrew,,04/23/1988,male,United States,$60000/$250,$4.5,
05/16/2018,Beacon International,863949,020,00072,ARS-01-0041074,201892862,,,,Carpio Pinto,Katherine,N,11/16/1991,female,United States,$1100000/$250,$21.24,
05/16/2018,Beacon International,863949,020,00072,ARS-01-0041073,201844488,,,,Coblentz,Ethan,T,08/31/1993,male,United States,$1100000/$250,$21.24,
05/15/2018,Beacon International,863949,020,00072,ARS-01-0041069,201850359,,,,Casagrande,Marco,,11/13/1962,male,United States,$60000/$250,$62.4,
05/15/2018,Beacon International,863949,020,00072,ARS-01-0041068,201822468,,,,Casagrande,Anne,,05/27/1963,female,United States,$60000/$250,$62.4,
05/16/2018,Beacon International,863949,020,00072,ARS-01-0041067,201890406,,,,Medal Montes,Silvia Emparo,,05/16/1984,female,El Salvador,$60000/$250,$4.5,
05/16/2018,Beacon International,863949,020,00072,ARS-01-0041066,201839986,,,,Cruz Molina,Luis Roberto,,08/25/1982,male,El Salvador,$60000/$250,$4.5,
05/16/2018,OverseasCare Visitors Insurance Plan,863949,020,00072,OVI-28-0041064,201880670,Passport(K1818972),,,Ahmad,Mohammed Samiuddin,S,04/13/1955,male,United States,$110000/$100,$220.22,
05/15/2018,Beacon America,863949,020,00072,ARS-02-0041063,201843522,Passport(511967739),,,Leslie,KatieBeth,,04/01/1992,female,United States,$1100000/$0,$687.22,
05/16/2018,Essential America,863949,020,00072,ARS-03-0040952,201848809,Passport(293521112),,,Isaac,Mark,Thomas,07/16/1967,male,Virgin Islands(British),$5000000/$5000,$1108,
05/16/2018,Essential America,863949,020,00072,ARS-03-0040952,201896271,,Passport(042727442),Spouse,Isaac,Karen ,Cynthia,11/19/1975,female,Virgin Islands(British),$5000000/$5000,$1028,
05/16/2018,Essential America,863949,020,00072,ARS-03-0040952,201875550,,Passport(288132335),Dependant,Isaac,Miles,Winchester,10/14/2007,male,Virgin Islands(British),$5000000/$5000,$388,
05/16/2018,Essential America,863949,020,00072,ARS-03-0040952,201818934,,Passport(281157112),Dependant,Isaac,Lucy,Barbara,06/14/2008,female,Virgin Islands(British),$5000000/$5000,$0,
05/15/2018,OverseasCare Visitors Insurance Plan,863949,020,00072,OVI-28-0041062,201890144,Passport(U14863577),,,Altuntas,Sevde,,06/09/1988,female,United States,$110000/$500,$124.2,
05/19/2018,Beacon America,863949,020,00072,ARS-02-0041056,201839700,,,,Mata Lara,Mariana,,02/27/1989,female,Hungary,$60000/$250,$6.2,
05/21/2018,Beacon International,863949,020,00072,ARS-01-0041055,201802749,,,,Welday,Habtemariam,T,01/01/1985,male,Eritrea,$60000/$250,$7.2,
05/15/2018,Beacon America,863949,020,00072,ARS-02-0041050,201865968,,,,SLEEMAN,SUSAN,A,05/21/1954,female,United States,$1100000/$1000,$534.4,
05/15/2018,Beacon America,863949,020,00072,ARS-02-0041049,201878272,Passport(538700452),,,SLEEMAN,IAN,H,02/26/1951,male,United States,$1100000/$1000,$588.8,
05/15/2018,Beacon International,863949,020,00072,ARS-01-0041048,201817358,,,,Capoor,Preeti,,11/26/1966,female,Canada,$550000/$1000,$36.96,
05/15/2018,Beacon International,863949,020,00072,ARS-01-0041047,201811786,Passport(HK865405),,,Masrani,ragesh,,05/20/1959,male,Canada,$550000/$1000,$36.96,
05/19/2018,Beacon America,863949,020,00072,ARS-02-0041045,201876526,,,,Freire,Kaitlyn,,03/07/1990,female,United States,$1100000/$250,$26.18,
05/21/2018,Beacon America,863949,020,00072,ARS-02-0041043,201819162,,,,Maynard,Candacy,,03/23/1975,female,United States,$60000/$0,$15.31,
05/20/2018,Beacon International,863949,020,00072,ARS-01-0041042,201821176,Passport(502446765),,,Keipper,Rebecca,,10/21/1994,female,United States,$1100000/$0,$97.35,
05/17/2018,Beacon International,863949,020,00072,ARS-01-0041041,201896830,Passport(527949764),,,Iyer,Rajiv,,07/04/1985,male,United States,$1100000/$0,$25.88,
05/14/2018,Beacon International,863949,020,00072,ARS-01-0041036,201891439,,,,Zolyomi,Ildiko,Z,03/25/1984,female,United States,$60000/$1000,$10.08,
05/14/2018,Beacon International,863949,020,00072,ARS-01-0041035,201859100,,,,Dunnick,Joseph,A,08/24/1975,male,United States,$60000/$1000,$16.8,
05/15/2018,Beacon International,863949,020,00072,ARS-01-0041034,201838712,,,,Patterson,Daniel,L,12/25/1987,male,Canada,$1100000/$1000,$92.74,
05/15/2018,Beacon International,863949,020,00072,ARS-01-0041033,201876715,Passport(AB593905),,,McGean,Kelly,L,01/06/1987,female,Canada,$1100000/$1000,$92.74,
05/17/2018,Beacon International,863949,020,00072,ARS-01-0041032,201888692,,,,Weinstock,Yehuda,,08/16/1970,male,United States,$60000/$0,$15,
05/17/2018,Beacon International,863949,020,00072,ARS-01-0041031,201861390,,,,Weinstock,Phyllis,,07/02/1945,female,United States,$50000/$0,$445.63,
05/17/2018,Beacon International,863949,020,00072,ARS-01-0041030,201871325,,,,Weinstock,Menachem,,11/18/1938,male,United States,$50000/$250,$1063.75,
05/17/2018,Beacon International,863949,020,00072,ARS-01-0041029,201869444,,,,Caplan,Leah ,,08/02/1972,female,United States,$60000/$0,$11.25,
05/14/2018,Beacon International,863949,020,00072,ARS-01-0041025,201811570,,,,meltz,justin,,01/27/1959,male,United States,$2000000/$250,$32.34,
05/14/2018,Beacon International,863949,020,00072,ARS-01-0041024,201824416,,,,metlz,dianne,,05/28/1964,female,United States,$2000000/$250,$32.34,
05/14/2018,Beacon International,863949,020,00072,ARS-01-0041023,201810085,,,,Meltz,Gabriella,,04/05/1996,female,United States,$2000000/$250,$11.48,
05/14/2018,Beacon America,863949,020,00072,ARS-02-0041022,201813278,,,,Song,Guoying,,11/25/1937,female,China,$12000/$250,$98,
05/21/2018,Beacon International,863949,020,00072,ARS-01-0041021,201809757,,,,Gebregziabher,Fsahaye,S,01/01/1971,male,Eritrea,$60000/$250,$16.5,
05/21/2018,Beacon International,863949,020,00072,ARS-01-0041020,201812203,,,,Gebrekrustos,Mulugheta,S,01/01/1986,male,Eritrea,$60000/$250,$9.9,
05/21/2018,Beacon International,863949,020,00072,ARS-01-0041019,201812500,,,,Tekie,Michiel,H,01/01/1986,male,Eritrea,$60000/$250,$9.9,
05/15/2018,Beacon America,863949,020,00072,ARS-02-0041018,201869408,Passport(J9436182),,,Sarma,Savithri,,08/11/1946,female,United States,$50000/$500,$200.88,
05/13/2018,Beacon International,863949,020,00072,ARS-01-0041017,201896279,,,,Fabian,Fernando,b,10/04/1954,male,United States,$60000/$250,$55.25,
05/13/2018,Beacon International,863949,020,00072,ARS-01-0041016,201893821,,,,ancheta,irma,b,09/13/1955,female,United States,$60000/$250,$55.25,
05/14/2018,Beacon International,863949,020,00072,ARS-01-0041015,201830209,,,,Loaiza,Rebecca,,12/05/1974,female,United States,$1100000/$0,$20,
05/15/2018,Beacon International,863949,020,00072,ARS-01-0041011,201803925,,,,Katz,Jacqueline,,06/05/1953,male,United States,$550000/$100,$66.5,
05/15/2018,Beacon International,863949,020,00072,ARS-01-0041010,201835124,Passport(530865062),,,Katz,Michael,,04/26/1957,male,United States,$550000/$100,$66.5,
05/14/2018,Beacon International,863949,020,00072,ARS-01-0041008,201853291,,,,Pallett,James,,11/05/1978,male,United States,$60000/$0,$5.63,
05/14/2018,Beacon International,863949,020,00072,ARS-01-0041007,201805893,,,,Carvalho,David,,05/18/1977,male,United States,$60000/$0,$9.38,
05/13/2018,Beacon International,863949,020,00072,ARS-01-0041004,201886710,,,,Vorce,Samantha,M,08/18/1994,female,United States,$60000/$250,$58.52,
05/15/2018,Beacon International,863949,020,00072,ARS-01-0041003,201813245,Passport(515634580),,,Lau,Wai,S B,12/04/1981,male,Canada,$60000/$100,$39.9,
05/12/2018,Beacon America,863949,020,00072,ARS-02-0041002,201838178,,,,Lopez,Aaron,S,11/10/1980,male,United States,$60000/$250,$8.2,
05/14/2018,Beacon America,863949,020,00072,ARS-02-0041001,201814878,Passport(HL940221),,,Grochowski,Sarah,L,12/17/1992,female,United States,$60000/$0,$122.45,
05/13/2018,Beacon America,863949,020,00072,ARS-02-0040998,201810664,,,,Nguyen,Xuan,T,03/10/1968,female,United States,$110000/$500,$156.64,
05/13/2018,Beacon America,863949,020,00072,ARS-02-0040997,201829964,Passport(123456),,,Ho,Hung,T,06/13/1962,male,United States,$110000/$500,$156.64,
05/13/2018,Beacon America,863949,020,00072,ARS-02-0040996,201895350,Passport(123456),,,Nguyen,Luu,T,08/10/1942,female,United States,$50000/$500,$246.24,
05/13/2018,Beacon America,863949,020,00072,ARS-02-0040995,201868220,Passport(C2198392),,,Tran,Hue,T,11/15/1949,female,United States,$110000/$500,$403.92,
05/12/2018,Beacon America,863949,020,00072,ARS-02-0040993,201838718,,,,Groeber,Burghardt,,03/06/1966,male,Japan,$110000/$2500,$20.84,
05/12/2018,Beacon America,863949,020,00072,ARS-02-0040992,201856195,,,,Neufeld,ANGELIQUE,,07/09/2012,female,United States,$60000/$250,$6.15,
05/13/2018,Beacon America,863949,020,00072,ARS-02-0040991,201847349,,,,Gutierrez,Abraham,,11/08/1995,male,Mexico,$60000/$0,$52.7,
05/12/2018,Beacon America,863949,020,00072,ARS-02-0040990,201853138,,,,Jamdade,Jasmine,G,09/04/2017,female,United States,$550000/$0,$76.5,
05/12/2018,Beacon America,863949,020,00072,ARS-02-0040989,201849424,Passport(TS0004934),,,Jamdade,Elliko,E,01/20/1987,female,United States,$550000/$0,$109.65,
05/13/2018,Beacon America,863949,020,00072,ARS-02-0040988,201867324,,,,RUBIO HERNANDEZ,LUIS CARLOS,,12/06/1993,male,Venezuela,$110000/$0,$13.48,
05/13/2018,Beacon America,863949,020,00072,ARS-02-0040987,201844084,,,,RUBIO HERNANDEZ,CARLA SOLEDAD,,05/03/1984,female,Venezuela,$110000/$0,$18.2,
05/13/2018,Beacon America,863949,020,00072,ARS-02-0040986,201884025,Passport(089205316),,,RUBIO PEREZ,LUIS CARLOS,,05/03/1957,male,Venezuela,$110000/$0,$51.19,
05/12/2018,Beacon International,863949,020,00072,ARS-01-0040985,201854615,,,,Izzo,Sergio,,04/30/1959,male,United States,$60000/$250,$13,
05/12/2018,Beacon International,863949,020,00072,ARS-01-0040984,201851081,,,,Barker,Lex,,11/12/1965,male,United States,$60000/$250,$13,
05/12/2018,Beacon International,863949,020,00072,ARS-01-0040983,201863139,,,,Gibbs,Ann Marie,,08/04/1963,male,United States,$60000/$250,$13,
05/12/2018,Beacon International,863949,020,00072,ARS-01-0040982,201886970,,,,Wilmore,Cierra,,05/12/1986,female,United States,$60000/$250,$4.5,
05/12/2018,Beacon International,863949,020,00072,ARS-01-0040981,201836850,,,,Lagana,Ashley,,10/19/1991,female,United States,$60000/$250,$3.8,
05/12/2018,Beacon International,863949,020,00072,ARS-01-0040980,201873209,,,,Harmon,Allison,J,04/29/1986,female,United States,$550000/$250,$29.7,
05/11/2018,Beacon International,863949,020,00072,ARS-01-0040978,201810560,,,,Mauviel,Isabelle,,09/03/1986,female,United States,$60000/$250,$24.3,
05/11/2018,Beacon International,863949,020,00072,ARS-01-0040977,201832156,,,,Franzl,Francois,,10/24/1985,male,United States,$60000/$250,$24.3,
05/12/2018,Beacon International,863949,020,00072,ARS-01-0040974,201884975,,,,Forbes,Aravel,,05/04/1964,female,United States,$1100000/$250,$34.54,
05/11/2018,Beacon International,863949,020,00072,ARS-01-0040970,201845551,,,,Clyne,Stefan,,06/07/1981,male,United States,$60000/$100,$9.9,
05/14/2018,Beacon International,863949,020,00072,ARS-01-0040969,201833295,,,,Weldesray,Hadas,F,01/01/1985,female,Eritrea,$60000/$250,$7.2,
05/15/2018,Beacon International,863949,020,00072,ARS-01-0040967,201845285,Passport(092733291),,,SALCEDO BUITRAGO,FRANK ALEJANDRO,A,08/19/1992,male,Venezuela,$60000/$0,$97.85,
05/11/2018,Beacon International,863949,020,00072,ARS-01-0040966,201829326,Passport(72 6749750),,,Vostrikova,Elena,,05/01/1985,female,Russia,$60000/$0,$7.32,
05/21/2018,Beacon International,863949,020,00072,ARS-01-0040963,201850898,,,,Walker,Paul,D,03/13/1980,male,United States,$1100000/$250,$477.48,
05/11/2018,Beacon International,863949,020,00072,ARS-01-0040960,201882224,,,,Mitchell,Ryan,M,07/20/1995,male,United States,$1100000/$100,$15.58,
05/11/2018,Beacon International,863949,020,00072,ARS-01-0040959,201891446,,,,Mitchell,Robert,J,06/19/1955,male,United States,$1100000/$100,$62.7,
05/11/2018,Beacon International,863949,020,00072,ARS-01-0040958,201875884,,,,Mitchell,Karen,H,02/27/1960,female,United States,$1100000/$100,$41.45,
05/20/2018,Beacon International,863949,020,00072,ARS-01-0040956,201881871,Passport(516797673),,,Chen,Iris,,10/20/1996,female,United States,$1100000/$0,$61.95,
05/10/2018,Beacon International,863949,020,00072,ARS-01-0040947,201843629,,,,Smith,Beresford,A,08/29/1960,male,United States,$550000/$100,$37.27,
05/10/2018,Beacon International,863949,020,00072,ARS-01-0040946,201870681,,,,Wiley Smith,Marchelle,A,10/01/1970,female,United States,$550000/$100,$23.72,
05/15/2018,Beacon International,863949,020,00072,ARS-01-0040941,201848566,Passport(593284661),,,Allen,Benjamin,,05/09/1997,male,United States,$1100000/$0,$119.48,
05/10/2018,Beacon America,863949,020,00072,ARS-02-0040939,201801585,,,,Scott,Amie,M,06/08/1981,female,United States,$1100000/$0,$18.88,
05/10/2018,Beacon America,863949,020,00072,ARS-02-0040938,201828978,,,,Gold,Aaron,J,10/20/1989,male,United States,$1100000/$0,$14.88,
05/10/2018,Beacon International,863949,020,00072,ARS-01-0040937,201837481,,,,Cook,Ginger,L,06/02/1972,female,United States,$1100000/$100,$26.4,
05/10/2018,Beacon International,863949,020,00072,ARS-01-0040936,201826285,,,,Cook,Scott,M,08/29/1972,male,United States,$1100000/$100,$26.4,
05/10/2018,Beacon America,863949,020,00072,ARS-02-0040935,201817932,,,,Irving,Stuart,D,09/01/1997,male,United Kingdom,$60000/$250,$52.08,
05/10/2018,Beacon International,863949,020,00072,ARS-01-0040934,201884202,Passport(310443218 ),,,Tai,TingJu,,12/03/1989,female,United States,$1100000/$0,$11.8,
05/11/2018,Beacon International,863949,020,00072,ARS-01-0040932,201853784,,,,Fong Flores,Siu ket,A,12/10/1981,male,United States,$60000/$250,$9.9,
05/10/2018,Beacon International,863949,020,00072,ARS-01-0040930,201898041,Passport(502800501),,,Hardesty,Michelle,,01/14/1995,female,United States,$60000/$0,$228.48,
05/16/2018,Beacon International,863949,020,00072,ARS-01-0040929,201824383,Passport(128177446),,,SANCHEZ CARRILLO,ELIDE ROSA CRUZ OMAIRA,,03/25/1955,female,Venezuela,$110000/$0,$288,
05/14/2018,Beacon America,863949,020,00072,ARS-02-0040926,201863140,,,,Kelshall,Jason,,09/04/1972,male,United States,$60000/$0,$15.31,
05/10/2018,Beacon International,863949,020,00072,ARS-01-0040925,201877211,,,,Losh,J. Brian,,11/24/1948,male,United States,$60000/$250,$85.36,
05/14/2018,Beacon America,863949,020,00072,ARS-02-0040924,201847828,,,,Gift,Vernly,,01/16/1969,male,United States,$60000/$0,$15.31,
05/14/2018,Beacon America,863949,020,00072,ARS-02-0040923,201829752,,,,Francis,Kerwin,,06/16/1973,male,United States,$60000/$0,$15.31,
05/14/2018,Beacon America,863949,020,00072,ARS-02-0040922,201860989,,,,Isaac,Akhenaton,,02/19/1982,male,United States,$60000/$0,$10.25,
05/14/2018,Beacon America,863949,020,00072,ARS-02-0040921,201897973,,,,Kelshall,Jason ,,09/04/1972,male,United States,$60000/$0,$15.31,
05/09/2018,Beacon International,863949,020,00072,ARS-01-0040920,201846437,,,,Alviedo,Neil Joseph,B,01/26/1970,male,United States,$60000/$250,$7.5,
05/10/2018,Beacon America,863949,020,00072,ARS-02-0040919,201894092,Passport(DJ5148623),,,Shahid,Amina,Mahmood,06/28/1958,female,Pakistan,$60000/$500,$466.56,
05/09/2018,Beacon International,863949,020,00072,ARS-01-0040918,201897945,,,,Nunez,Alejandro,,11/23/1989,male,United States,$550000/$0,$23.38,
05/09/2018,Essential International,863949,020,00072,ARS-03-0040903,201842772,Passport(580619052),,,blayer,brooke,ann,02/12/1988,female,United States,$5000000/$1000,$938,
05/17/2018,Beacon International,863949,020,00072,ARS-01-0040916,201871497,,,,Weldemariam,Hermon,A,01/01/1990,female,Eritrea,$60000/$250,$3.8,
05/09/2018,Beacon International,863949,020,00072,ARS-01-0040914,201833113,,,,scholtz,brendon,p,09/02/1969,male,United States,$550000/$100,$36.65,
05/13/2018,Beacon America,863949,020,00072,ARS-02-0040912,201893554,Passport(AQ247039),,,SARMIENTO OLARTE,MONICA LUCIA,MS,04/18/1976,female,Colombia,$550000/$0,$70,
05/13/2018,Beacon America,863949,020,00072,ARS-02-0040911,201846818,Passport(AN658476),,,SANCHEZ ,HECTOR ,,11/21/1970,male,Colombia,$550000/$0,$70,
05/14/2018,Beacon America,863949,020,00072,ARS-02-0040910,201861097,Passport(AT000197),,,HERRERA ECHEVERRI,NATALIA,,08/03/1984,female,Colombia,$550000/$0,$41.93,
05/08/2018,Beacon International,863949,020,00072,ARS-01-0040909,201894552,,,,Berroteran Olivo,Santiago Daniel,SB,05/03/2007,male,Venezuela,$60000/$0,$54.25,
05/08/2018,Beacon International,863949,020,00072,ARS-01-0040908,201818125,,,,Gonzales Olivo,Miranda,MG,10/31/2017,female,Venezuela,$60000/$0,$54.25,
05/08/2018,Beacon International,863949,020,00072,ARS-01-0040907,201819603,,,,Olivo Fermin,Solsiree Danmari,SO,11/14/1985,female,Venezuela,$60000/$0,$69.75,
05/08/2018,Beacon International,863949,020,00072,ARS-01-0040906,201847195,Passport(054337886),,,Gonzales Verdejo,Omar Andres,OG,03/11/1989,male,Venezuela,$60000/$0,$58.9,
05/10/2018,Beacon America,863949,020,00072,ARS-02-0040905,201859625,,,,Skea,Ryan,,12/14/1984,male,Canada,$1100000/$250,$90.6,
05/13/2018,Beacon America,863949,020,00072,ARS-02-0040904,201830375,Passport(AS418544),,,Isaza Quebrada,Jorge ,,08/11/1954,male,Colombia,$550000/$0,$122.5,
05/09/2018,Beacon International,863949,020,00072,ARS-01-0040902,201811532,,,,Cortes Collins,Matias,,11/23/2017,male,United States,$1100000/$250,$33.8,
05/21/2018,Beacon International,863949,020,00072,ARS-01-0040900,201882335,,,,Gebreyesus,Amanuel,K,01/01/1978,male,Eritrea,$60000/$250,$16.5,