Original Effective Date,Plan Type,Control,Suffix,Account,Policy Number,ID,EE SSN,Dependent SSN,Dependent Relationship,Last Name,First Name,Middle Initial,DOB,Gender,Country,Premium,
05/10/2018,Beacon America,863949,020,00072,ARS-02-0040939,201801585,,,,Scott,Amie,M,06/08/1981,female,United States,18.88,
05/10/2018,Beacon America,863949,020,00072,ARS-02-0040938,201828978,,,,Gold,Aaron,J,10/20/1989,male,United States,14.88,
05/10/2018,Beacon International,863949,020,00072,ARS-01-0040937,201837481,,,,Cook,Ginger,L,06/02/1972,female,United States,26.4,
05/10/2018,Beacon International,863949,020,00072,ARS-01-0040936,201826285,,,,Cook,Scott,M,08/29/1972,male,United States,26.4,
05/10/2018,Beacon America,863949,020,00072,ARS-02-0040935,201817932,,,,Irving,Stuart,D,09/01/1997,male,United Kingdom,52.08,
05/10/2018,Beacon International,863949,020,00072,ARS-01-0040934,201884202,Passport(310443218 ),,,Tai,TingJu,,12/03/1989,female,United States,11.8,
05/10/2018,Beacon International,863949,020,00072,ARS-01-0040930,201898041,Passport(502800501),,,Hardesty,Michelle,,01/14/1995,female,United States,228.48,
05/10/2018,Beacon International,863949,020,00072,ARS-01-0040925,201877211,,,,Losh,J. Brian,,11/24/1948,male,United States,85.36,
05/10/2018,Beacon America,863949,020,00072,ARS-02-0040919,201894092,Passport(DJ5148623),,,Shahid,Amina,Mahmood,06/28/1958,female,United States,466.56,
05/10/2018,Beacon America,863949,020,00072,ARS-02-0040905,201859625,,,,Skea,Ryan,,12/14/1984,male,Canada,90.6,
05/10/2018,Beacon International,863949,020,00072,ARS-01-0040841,201859238,Passport(460967769),,,Gill,Daniel,,10/25/1956,male,United States,79.56,
05/10/2018,Beacon America,863949,020,00072,ARS-02-0040807,201846835,Passport(141553621),,,ECHEVERRIA MOLINA,GRACIELA DEL CARMEN ,,06/29/1957,female,Venezuela,135.69,
05/10/2018,Beacon America,863949,020,00072,ARS-02-0040806,201812293,Passport(14111167),,,MOLINA DE ECHEVERRIA,CARMEN TERESA,CTME,05/23/1933,female,Venezuela,199.06,
05/10/2018,Beacon International,863949,020,00072,ARS-01-0040645,201873515,Passport(SG4324915),,,Dominguez,Maria,,02/13/1958,female,United States,125,
05/10/2018,Beacon International,863949,020,00072,ARS-01-0040408,201828463,Passport(515135990),,,Hilcove,Malcolm,M,07/07/1946,male,United States,191.48,
05/10/2018,Beacon International,863949,020,00072,ARS-01-0040407,201824878,Passport(515135992),,,Hilcove,PeggyAnne,,07/16/1949,female,United States,248.09