Eff. Date,Plan Type,Control,Suffix,Account,ID,EE SSN,Dependent SSN,Dependent Relationship,Last Name,First Name,Middle Initial,DOB,Gender,Country,Premium,
05/03/2018,Beacon America,863949,020,00072,201884654,,,,Wind,Nosson,,01/30/2009,male,United States,12.5,
05/03/2018,Beacon America,863949,020,00072,201810039,,,,Wind,Moshe,,02/05/2006,male,United States,12.5,
05/03/2018,Beacon America,863949,020,00072,201880598,,,,Wind,Pinchas,,04/22/1970,male,United States,27.63,
05/03/2018,Beacon America,863949,020,00072,201829934,,,,Baserdem,Baturalp,,11/03/1986,male,United States,8.2,
05/03/2018,Beacon America,863949,020,00072,201878646,,,,moskowitz,elimelech,,03/27/1990,male,United States,14.88,
05/02/2018,Beacon America,863949,020,00072,201851984,,,,esckstein,ARYEH ,,02/17/1989,male,United States,13.63,
05/03/2018,Beacon America,863949,020,00072,201842593,,,,Spira,Zurich,,03/02/1992,male,United States,14.88,
05/03/2018,Beacon America,863949,020,00072,201888397,,,,klein,lipa,,09/22/1990,male,United States,14.88,
05/03/2018,Beacon America,863949,020,00072,201893419,,,,koth,shia,,10/13/2008,male,United States,12.5,
05/03/2018,Beacon America,863949,020,00072,201854948,,,,koth,joseph,,06/05/1986,male,United States,18.88,
05/03/2018,Beacon America,863949,020,00072,201865517,,,,Halpert,Jacob,,09/17/1994,male,United States,14.88,
05/03/2018,Beacon America,863949,020,00072,201878687,,,,Grosz,Hinda,,12/15/1992,male,United States,14.88,
05/02/2018,Beacon America,863949,020,00072,201836525,Passport(085194007),,,Rutmann Camaran,Frances ,L,10/04/1944,female,United States,156.24,
05/03/2018,Beacon America,863949,020,00072,201862455,,,,moscowicz,shlomo,,12/03/1990,male,United States,13.63,
05/01/2018,Beacon America,863949,020,00072,201845066,Passport(CJ4703837),,,Najjar,Youssef,,10/20/1992,male,United States,221.76,
05/02/2018,Beacon America,863949,020,00072,201809016,,,,Traversa,Maria Dionigia,,09/26/1949,female,Italy,78,
05/01/2018,Beacon America,863949,020,00072,201860976,,,,Horowitz,Binyomin,,04/20/2018,male,United States,37.5,
05/01/2018,Beacon America,863949,020,00072,201809532,,,,horowitz,meir,,08/25/2016,male,United States,37.5,
05/03/2018,Beacon America,863949,020,00072,201833386,,,,ungar,yisroel,,08/19/1992,male,United States,14.88,
05/01/2018,Beacon America,863949,020,00072,201890552,Passport(C4246461),,,T,Lung,Nguyen,07/12/1944,female,United States,207,
05/02/2018,Beacon America,863949,020,00072,201843769,,,,Meirovitz,Rivky,,01/21/2016,female,United States,12.5,
05/02/2018,Beacon America,863949,020,00072,201852977,,,,Meirovitz,Leah,,02/03/2012,female,United States,12.5,
05/02/2018,Beacon America,863949,020,00072,201813728,,,,Meirovitz,Tilly,,11/24/2009,female,United States,12.5,
05/02/2018,Beacon America,863949,020,00072,201803444,,,,Meirovitz,Henny,,08/14/2008,female,United States,12.5,
05/02/2018,Beacon America,863949,020,00072,201827427,,,,Meirovitz,Channa,,10/05/1988,female,United States,14.88,
05/02/2018,Beacon America,863949,020,00072,201863077,,,,Meirovitz,Abraham,,06/16/1988,male,United States,14.88,
05/03/2018,Beacon America,863949,020,00072,201868209,,,,glick,shabsi,,04/10/1986,male,United States,16.13,
04/30/2018,Beacon America,863949,020,00072,201847840,,,,Semenova,Iryna,,08/21/1997,female,Ukraine,12.4,
05/03/2018,Beacon America,863949,020,00072,201862567,Passport(L7144555),,,SARANGI,NIRANJAN,,04/15/1939,male,United States,252,
05/01/2018,Beacon America,863949,020,00072,201834878,Passport(XDA413877),,,Pestana Perera,Carlos Rafael,,11/24/1934,male,United States,341.78,
05/01/2018,Beacon America,863949,020,00072,201858337,Passport(ZN484781),,,KOPULANDE,JANET,K K,08/08/1951,female,United States,42.5,
05/01/2018,Beacon America,863949,020,00072,201868511,,,,joshi,rama,,06/01/1943,female,United States,655.2,
04/28/2018,Beacon America,863949,020,00072,201873286,,,,Lopez,Aaron,S,11/10/1980,male,United States,8.2,
05/02/2018,Beacon America,863949,020,00072,201845600,,,,VARANASY,SAVITHRI ,,12/18/1943,female,United States,25.2,
05/02/2018,Beacon America,863949,020,00072,201882546,Passport(K0345052),,,Kannappa,Ethirajan,,04/10/1939,male,United States,432,
05/01/2018,Beacon America,863949,020,00072,201874507,,,,Kapurova,Maryna,,11/11/1986,female,Ukraine,245.18,
04/27/2018,Beacon America,863949,020,00072,201858483,,,,Ni&ntilde;oles Aznar,Pablo,,02/23/1991,male,Spain,6.2,
05/03/2018,Beacon America,863949,020,00072,201859969,,,,hantstater,yaakov,,03/11/2008,male,United States,12.5,
05/03/2018,Beacon America,863949,020,00072,201886423,,,,hanstater,Joseph,,09/25/1978,male,United States,18.88,
04/27/2018,Beacon America,863949,020,00072,201880828,,,,Rajmangal,Martin,,07/12/1984,male,United States,14.35,
04/27/2018,Beacon America,863949,020,00072,201875045,,,,David,Gornall,,08/05/1967,male,United States,40.08,
04/27/2018,Beacon America,863949,020,00072,201841477,,,,Thompson,Dedrick,,11/21/1991,male,United States,13.48,
04/27/2018,Beacon America,863949,020,00072,201875271,,,,Benjamin,Amais,,06/16/1987,male,United States,14.35,
04/28/2018,Beacon America,863949,020,00072,201867421,,,,Sandiford,Andy,,06/08/1984,male,United States,12.3,
05/02/2018,Beacon America,863949,020,00072,201885597,,,,Weber,Yuda,,12/17/2009,male,United States,12.5,
05/02/2018,Beacon America,863949,020,00072,201878772,,,,Weber,solomon,,10/10/1988,male,United States,14.88,
04/27/2018,Beacon America,863949,020,00072,201834434,,,,Languedoc,Michael,,05/16/1977,male,United States,21.44,
04/27/2018,Beacon America,863949,020,00072,201823714,,,,Scotland,Sharlaila,,03/28/1986,female,United States,14.35,
04/27/2018,Beacon America,863949,020,00072,201816488,,,,Leslie,Cleon,,11/21/1981,male,United States,14.35,
04/27/2018,Beacon America,863949,020,00072,201860460,,,,Seaman,Dwayne,,08/30/1981,male,United States,14.35,
04/27/2018,Beacon America,863949,020,00072,201844014,,,,Laurent ,Oral,,05/12/1970,male,United States,21.44,
04/28/2018,Beacon America,863949,020,00072,201899657,,,,Rogers,Vallen,,07/11/1992,male,United States,11.55,
04/28/2018,Beacon America,863949,020,00072,201836882,,,,Rawlins,Kristin ,,05/18/1981,male,United States,12.3,
04/28/2018,Beacon America,863949,020,00072,201801992,,,,Lake,Kayane,,06/09/1983,male,United States,12.3,
04/28/2018,Beacon America,863949,020,00072,201840251,,,,Isaac,Spencer ,,08/26/1986,male,United States,12.3,
04/28/2018,Beacon America,863949,020,00072,201893248,,,,Dowell,Desmond ,,01/02/1968,male,United States,27,
04/28/2018,Beacon America,863949,020,00072,201862332,,,,Samuel,Winston ,,12/12/1989,male,United States,11.55,
04/28/2018,Beacon America,863949,020,00072,201842566,,,,Charles,Phernel,,04/29/1974,male,United States,18.38,
04/28/2018,Beacon America,863949,020,00072,201825496,,,,Pilgrim,Glaston ,,12/26/1963,male,United States,27,
04/28/2018,Beacon America,863949,020,00072,201807042,,,,Ashton,Iria ,,05/15/1984,male,United States,12.3,
04/28/2018,Beacon America,863949,020,00072,201889308,,,,Samuel,Winston,,12/12/1989,male,United States,15.4,
04/26/2018,Beacon America,863949,020,00072,201896084,Passport(B4628030),,,Duong,Ngoc Luu,,08/19/1949,female,United States,403,
04/28/2018,Beacon America,863949,020,00072,201882450,,,,Matthias,Edson,,01/21/1974,male,United States,18.38,
04/28/2018,Beacon America,863949,020,00072,201864295,,,,Lessey,Curlan,,03/13/1984,male,United States,12.3,
04/28/2018,Beacon America,863949,020,00072,201854607,,,,Andrews,Niva,,11/04/1973,female,United States,18.38,
04/28/2018,Beacon America,863949,020,00072,201816648,,,,Young,Elizah,,03/20/1986,male,United States,12.3,
04/28/2018,Beacon America,863949,020,00072,201829177,,,,Thomas,Roland ,,07/31/1960,male,United States,27,
04/28/2018,Beacon America,863949,020,00072,201859878,,,,Williams,Dexter,,10/11/1964,male,United States,27,
04/28/2018,Beacon America,863949,020,00072,201878515,,,,John,Claurent ,,06/03/1989,male,United States,11.55,
04/28/2018,Beacon America,863949,020,00072,201816441,,,,Donal,Josaphat ,,11/04/1967,male,United States,27,
04/28/2018,Beacon America,863949,020,00072,201825121,,,,Auguste,Bradley,,04/07/1987,male,United States,12.3,
04/28/2018,Beacon America,863949,020,00072,201812336,,,,Charles,Stanius ,,04/01/1984,male,United States,12.3,
04/28/2018,Beacon America,863949,020,00072,201823833,,,,Sandiford,Andy,,06/08/1984,male,United States,12.3,
04/28/2018,Beacon America,863949,020,00072,201889850,,,,Etienne,Auzy,,04/02/1970,male,United States,18.38,
04/28/2018,Beacon America,863949,020,00072,201817359,,,,Otto,Sean ,,08/18/1990,male,United States,11.55,
04/28/2018,Beacon America,863949,020,00072,201848594,,,,Common,Alvin ,,07/13/1981,male,United States,12.3,
04/28/2018,Beacon America,863949,020,00072,201850829,,,,Adams,Royston,,07/14/1973,male,United States,18.38,
04/28/2018,Beacon America,863949,020,00072,201889399,,,,DeSilva,Kevin,,09/02/1974,male,United States,18.38,
04/28/2018,Beacon America,863949,020,00072,201810969,,,,Morris,Derick,,01/10/1966,male,United States,27,
04/28/2018,Beacon America,863949,020,00072,201896254,,,,Walthrust,Pedro,,04/15/1970,male,United States,18.38,
04/28/2018,Beacon America,863949,020,00072,201818568,Passport(AN512823),,,GALLO CAMPOS,NICOLAS,F,02/24/1985,male,Colombia,32.25,
04/28/2018,Beacon America,863949,020,00072,201841226,,,,Pinder,Lecia,,08/06/1983,female,United States,12.3,
04/28/2018,Beacon America,863949,020,00072,201894177,,,,Small,Leland,,09/17/1961,male,United States,27,
04/28/2018,Beacon America,863949,020,00072,201804217,,,,Alleyne,Ron,,05/14/1975,male,United States,18.38,
04/30/2018,Beacon America,863949,020,00072,201851530,Passport(H2900380),,,Narayanan,Kamala,,05/25/1948,female,United States,423.05,
04/29/2018,Beacon America,863949,020,00072,201855145,,,,Malkiel,Alex,,02/18/1987,male,United States,125.05,
05/01/2018,Beacon America,863949,020,00072,201867941,Passport(HL573184),,,Warner,Kristen,,04/14/1973,female,United States,92.38,
04/24/2018,Beacon America,863949,020,00072,201869849,,,,Mugisha,Grace,B,09/17/1997,female,Burundi,49.1,
04/24/2018,Beacon America,863949,020,00072,201804130,,,,Ndikumana,Evariste,,04/07/1979,male,Burundi,64.94,
04/24/2018,Beacon America,863949,020,00072,201842785,Passport(AQ341945),,,Orostegui,Victor,,05/25/1991,male,Colombia,87.2,
05/01/2018,Beacon America,863949,020,00072,201853500,,,,SALOM,MARIA FABIANA,,02/27/2013,female,Venezuela,77.17,
05/01/2018,Beacon America,863949,020,00072,201884424,Passport(145083247),,,SALOM,JESUS EDUARDO,,02/27/2013,male,Venezuela,77.17,
04/25/2018,Beacon America,863949,020,00072,201838917,Passport(AO430463),,,Diaz,Harold,,08/17/1975,male,Colombia,80,
04/24/2018,Beacon America,863949,020,00072,201843417,Passport(ZN484781),,,KOPULANDE,JANET,K K,08/08/1951,female,United States,59.5,
04/22/2018,Beacon America,863949,020,00072,201842441,Passport(3328322),,,VELASQUEZ CESIN,ALBERTO,,11/14/1947,male,Venezuela,86.4,
04/26/2018,Beacon America,863949,020,00072,201808192,,,,Darmani,Homa,(,06/30/1961,female,Jordan,315,
04/21/2018,Beacon America,863949,020,00072,201818971,Passport(K5059634),,,Tirumalai,Rangarajan,,06/10/1940,male,United States,324.72,
04/20/2018,Beacon America,863949,020,00072,201847318,,,,tubman,susan,l,10/08/1958,female,Grenada,158.76,
04/20/2018,Beacon America,863949,020,00072,201818837,,,,anderson,jeff,h,01/16/1956,male,Grenada,198.45,
04/20/2018,Beacon America,863949,020,00072,201826445,,,,Okunev,Zakhar,V,04/30/1995,male,Canada,32.73,
04/19/2018,Beacon America,863949,020,00072,201823711,,,,Hazzard,Jade,A,03/03/1999,female,United States,7.7,
04/19/2018,Beacon America,863949,020,00072,201872727,,,,Hazzard,Annette,P,06/01/1963,female,United States,22.9,
04/19/2018,Beacon America,863949,020,00072,201878157,,,,Hazzard,Terence,D,01/13/1958,male,United States,29.25,
04/18/2018,Beacon America,863949,020,00072,201867937,Passport(G43301316),,,LU,JIANJING,,05/09/1952,male,United States,344.25,
04/21/2018,Beacon America,863949,020,00072,201826192,,,,Leckie,Deborah,P,01/02/1966,female,Suriname,103.5,
04/19/2018,Beacon America,863949,020,00072,201864093,Passport(7291611421),,,Shilnikova,Galina,,07/29/1952,female,United States,193.2,
04/19/2018,Beacon America,863949,020,00072,201854827,Passport(303095979),,,Tsai,Ming Feng,,10/09/1985,male,United States,72.24,
04/19/2018,Beacon America,863949,020,00072,201855124,Passport(310734286),,,Yuan,Ko Lung,,09/30/1988,male,United States,61.04,
04/16/2018,Beacon America,863949,020,00072,201833031,Passport(MM0292618),,,Mateo de Arias,Mayelyn,,04/26/1977,female,United States,163.6,
04/16/2018,Beacon America,863949,020,00072,201872374,,,,Arias Rodriguez,Amaury,,10/04/1977,male,United States,163.6,
04/16/2018,Beacon America,863949,020,00072,201868069,,,,Eisenberg,Saadia ,,01/01/1970,male,United States,182.33,
04/27/2018,Beacon America,863949,020,00072,201827349,,,,Gureja,Sunita,,09/17/1954,female,United States,405.41,
04/17/2018,Beacon America,863949,020,00072,201829377,Passport(PT9128138),,,DOOLAN ,KENMAR,Z,12/19/1994,male,Venezuela,21.18,
04/17/2018,Beacon America,863949,020,00072,201896060,Passport(120533262),,,MORA NAYATI,JOSE JORGE,,04/25/1968,male,Venezuela,38.68,
04/17/2018,Beacon America,863949,020,00072,201870210,Passport(085547346),,,MORA NAYATI,JORGE ANTONIO,,05/18/1971,male,Venezuela,38.68,
04/14/2018,Beacon America,863949,020,00072,201862595,Passport(YA1737278),,,Ciampa,Giuseppe,,08/27/1985,male,Italy,46.8,
04/13/2018,Beacon America,863949,020,00072,201892437,,,,Isbister,Gisele,J,05/17/2006,female,Canada,6.15,
04/13/2018,Beacon America,863949,020,00072,201825583,,,,Fioccardo,Marco,,10/29/1968,male,Italy,235.42,
04/27/2018,Beacon America,863949,020,00072,201847469,Passport(08260014807),,,Almada,Pablo,Borquez,01/19/1961,male,United States,1656.2,
05/01/2018,Beacon America,863949,020,00072,201809947,Passport(n/a),,,Gonzalez Maldonado,Miller,,07/04/1976,male,Colombia,390,
05/01/2018,Beacon America,863949,020,00072,201850962,Passport(na),,,Rodriguez Toro,John Freddy,,07/28/1983,male,Colombia,251.55,
05/03/2018,Beacon America,863949,020,00072,201856320,,,,Worrall,Stephen,A,01/21/1967,male,Japan,39,
04/12/2018,Beacon America,863949,020,00072,201877454,Passport(554930098),,,Tauber ,Schneur ,Z,01/27/2001,male,United States,99.14,
04/11/2018,Beacon America,863949,020,00072,201818379,,,,Gillott,Sharon,M,05/17/1960,female,Australia,126,
04/11/2018,Beacon America,863949,020,00072,201818789,,,,Gadsing,Surekha,G,07/05/1964,female,United States,317.52,
04/11/2018,Beacon America,863949,020,00072,201837032,Passport(P6232598),,,Gadsing,Gorakh,M,06/01/1952,male,United States,458.64,
04/18/2018,Beacon America,863949,020,00072,201868599,Passport(J7878286),,,Mudunuru,Vishnu Sarma,,02/04/1940,male,United States,447.12,
04/15/2018,Beacon America,863949,020,00072,201801441,,,,Quinonez,Emilio,,05/13/1982,male,United States,14.35,
04/15/2018,Beacon America,863949,020,00072,201826802,,,,Banner,Jared,,12/18/1978,male,United States,14.35,
04/14/2018,Beacon America,863949,020,00072,201876336,Passport(055943668),,,LOPEZ TARABAY,ALFONSO,,03/31/1965,male,Venezuela,45.8,
04/10/2018,Beacon America,863949,020,00072,201843611,,,,Ali,Hareem,F,08/01/2016,female,United Kingdom,52.5,
04/10/2018,Beacon America,863949,020,00072,201873455,,,,Naseem,Rabia,,12/06/1984,female,United Kingdom,78,
04/10/2018,Beacon America,863949,020,00072,201805082,,,,Kayani,Raja,A,11/06/1982,male,United Kingdom,78,
04/10/2018,Beacon America,863949,020,00072,201800894,Passport(E907918),,,Hidalgo,Gerardo,,03/02/1973,male,United States,66.3,
05/01/2018,Beacon America,863949,020,00072,201831676,Passport(na),,,Zambrano Zapateiro,Orlando Jose,,12/02/1977,male,Colombia,390,
05/01/2018,Beacon America,863949,020,00072,201860851,Passport(na),,,Rueda Martinez,Juan Carlos,,07/19/1974,male,Colombia,390,
05/01/2018,Beacon America,863949,020,00072,201856259,Passport(na),,,Cristancho Camacho,Johon Ferney,,01/13/1988,male,Colombia,251.55,
05/01/2018,Beacon America,863949,020,00072,201892646,Passport(na),,,Rojas Jimenez,Gonzalo Israel,,11/12/1982,male,Colombia,251.55,
04/10/2018,Beacon America,863949,020,00072,201896598,,,,Fadnis,Prerana,,03/11/1952,female,United States,625.6,
04/10/2018,Beacon America,863949,020,00072,201875772,Passport(M7109229),,,Fadnis,Prakash,,08/26/1948,male,United States,625.6,
05/01/2018,Beacon America,863949,020,00072,201814610,Passport(na),,,Merchan Duarte,Gonzalo,,05/23/1983,male,Colombia,251.55,
05/01/2018,Beacon America,863949,020,00072,201853457,,,,Tejada Pinzon,Jhonn Edinson,,06/05/1985,male,Colombia,251.55,
04/09/2018,Beacon America,863949,020,00072,201870621,Passport(YB1056949),,,Masciulli,Laura,,04/21/1983,female,Italy,281.42,
04/13/2018,Beacon America,863949,020,00072,201888393,Passport(ZN484781),,,KOPULANDE,JANET,K K,08/08/1951,female,United States,93.5,
04/10/2018,Beacon America,863949,020,00072,201810856,Passport(047643297),,,SANCHEZ,ELIECER,G,08/29/1982,male,Venezuela,41.6