Eff. Date,Plan Type,Control,Suffix,Account,ID,EE SSN,Dependent SSN,Dependent Relationship,Last Name,First Name,Middle Initial,DOB,Gender,Country,Premium,
05/03/2018,Beacon America,863949,020,00072,201829934,,,,Baserdem,Baturalp,,11/03/1986,male,United States,8.2,
05/03/2018,Beacon America,863949,020,00072,201878646,,,,moskowitz,elimelech,,03/27/1990,male,United States,14.88,
05/02/2018,Beacon International,863949,020,00072,201821137,,,,Kaff,Abraham,,08/01/1973,male,United States,7.5,
05/03/2018,Essential America,863949,020,00072,201865478,Passport(099165256),,,Frost,Rowena,Jane,09/25/1976,female,United Kingdom,2217,
05/02/2018,Beacon America,863949,020,00072,201851984,,,,esckstein,ARYEH ,,02/17/1989,male,United States,13.63,
05/03/2018,Beacon America,863949,020,00072,201842593,,,,Spira,Zurich,,03/02/1992,male,United States,14.88,
05/03/2018,Beacon America,863949,020,00072,201888397,,,,klein,lipa,,09/22/1990,male,United States,14.88,
05/02/2018,Beacon International,863949,020,00072,201834301,,,,Emmons,Kate,O,01/03/1997,female,United States,67.64,
05/02/2018,Beacon International,863949,020,00072,201896657,,,,McLarnan,Ann,L,08/19/1956,female,United States,28.8,
05/02/2018,Beacon International,863949,020,00072,201840576,,,,McLarnan,Timothy,J,04/24/1953,male,United States,34,
05/02/2018,Beacon International,863949,020,00072,201821766,,,,McLarnan,Peter,C,04/30/1987,male,United States,8.64,
05/02/2018,Beacon International,863949,020,00072,201829409,,,,McLarnan,Nina,E,04/04/1996,female,United States,7.6,
05/02/2018,Beacon International,863949,020,00072,201802561,,,,McLarnan,Joanna,H,04/13/1993,female,United States,7.6,
05/03/2018,Beacon America,863949,020,00072,201893419,,,,koth,shia,,10/13/2008,male,United States,12.5,
05/03/2018,Beacon America,863949,020,00072,201854948,,,,koth,joseph,,06/05/1986,male,United States,18.88,
05/03/2018,Beacon America,863949,020,00072,201865517,,,,Halpert,Jacob,,09/17/1994,male,United States,14.88,
05/03/2018,Beacon America,863949,020,00072,201878687,,,,Grosz,Hinda,,12/15/1992,male,United States,14.88,
05/02/2018,Beacon International,863949,020,00072,201859071,,,,Connelly,Patrick,J,09/06/1976,male,United States,24,
05/02/2018,Beacon International,863949,020,00072,201851937,Passport(481107424),,,Rayle,Victoria,R,06/23/1989,male,United States,345.8,
05/02/2018,Beacon America,863949,020,00072,201836525,Passport(085194007),,,Rutmann Camaran,Frances ,L,10/04/1944,female,United States,156.24,
05/03/2018,Beacon America,863949,020,00072,201862455,,,,moscowicz,shlomo,,12/03/1990,male,United States,13.63,
05/01/2018,Beacon America,863949,020,00072,201845066,Passport(CJ4703837),,,Najjar,Youssef,,10/20/1992,male,United States,221.76,
05/01/2018,Beacon International,863949,020,00072,201889591,,,,Cardin,Trevor,M,07/20/1973,male,United States,30,
05/02/2018,Beacon America,863949,020,00072,201809016,,,,Traversa,Maria Dionigia,,09/26/1949,female,Italy,78,
05/01/2018,Beacon America,863949,020,00072,201860976,,,,Horowitz,Binyomin,,04/20/2018,male,United States,37.5,
05/01/2018,Beacon America,863949,020,00072,201809532,,,,horowitz,meir,,08/25/2016,male,United States,37.5,
05/03/2018,Beacon America,863949,020,00072,201833386,,,,ungar,yisroel,,08/19/1992,male,United States,14.88,
05/02/2018,Beacon International,863949,020,00072,201867789,,,,Cherry,Nathanael,A,02/17/1981,male,Saudi Arabia,7.2,
04/30/2018,Beacon International,863949,020,00072,201816745,,,,Fujii,Chara,,12/15/1981,female,United States,11.7,
05/01/2018,Beacon America,863949,020,00072,201890552,Passport(C4246461),,,T,Lung,Nguyen,07/12/1944,female,United States,207,
05/02/2018,Beacon America,863949,020,00072,201843769,,,,Meirovitz,Rivky,,01/21/2016,female,United States,12.5,
05/02/2018,Beacon America,863949,020,00072,201852977,,,,Meirovitz,Leah,,02/03/2012,female,United States,12.5,
05/02/2018,Beacon America,863949,020,00072,201813728,,,,Meirovitz,Tilly,,11/24/2009,female,United States,12.5,
05/02/2018,Beacon America,863949,020,00072,201803444,,,,Meirovitz,Henny,,08/14/2008,female,United States,12.5,
05/02/2018,Beacon America,863949,020,00072,201827427,,,,Meirovitz,Channa,,10/05/1988,female,United States,14.88,
05/02/2018,Beacon America,863949,020,00072,201863077,,,,Meirovitz,Abraham,,06/16/1988,male,United States,14.88,
05/03/2018,Beacon America,863949,020,00072,201868209,,,,glick,shabsi,,04/10/1986,male,United States,16.13,
05/01/2018,Essential America,863949,020,00072,201874314,Passport(G0114872),,,Thompson,Ryan,Ashley,07/17/1984,male,Grenada,677.3,
04/30/2018,Beacon America,863949,020,00072,201847840,,,,Semenova,Iryna,,08/21/1997,female,Ukraine,12.4,
05/03/2018,Beacon America,863949,020,00072,201862567,Passport(L7144555),,,SARANGI,NIRANJAN,,04/15/1939,male,United States,252,
04/30/2018,OverseasCare Visitors Insurance Plan,863949,020,00072,201807458,Passport(P9274599),,,Gupta,Ramawatidevi,S,04/15/1947,female,United States,302.56,
04/30/2018,OverseasCare Visitors Insurance Plan,863949,020,00072,201857157,Passport(P9274599),,,Gupta,Shivpujan,S,03/10/1947,male,United States,302.56,
05/01/2018,Beacon America,863949,020,00072,201834878,Passport(XDA413877),,,Pestana Perera,Carlos Rafael,,11/24/1934,male,United States,341.78,
05/01/2018,Beacon America,863949,020,00072,201858337,Passport(ZN484781),,,KOPULANDE,JANET,K K,08/08/1951,female,United States,42.5,
04/29/2018,Beacon International,863949,020,00072,201862566,,,,Taubenfeld ,Yosef ,,10/09/1998,male,United States,75.02,
04/29/2018,Beacon International,863949,020,00072,201821866,,,,Taubenfeld,Jacob ,,08/02/1994,male,United States,113.74,
04/30/2018,Beacon International,863949,020,00072,201868345,,,,Bodansky,Esther,,05/31/1977,female,United States,34.3,
04/30/2018,Beacon International,863949,020,00072,201854147,,,,Bodansky,Berl,,11/07/1976,male,United States,34.3,
04/29/2018,Beacon International,863949,020,00072,201853303,,,,Franklin,Katherine,A,03/07/1991,female,United States,16.72,
04/30/2018,Beacon International,863949,020,00072,201864891,Passport(722277033),,,Ermoshina,Anna,Pavlovna,01/19/1987,female,Russia,21.94,
04/29/2018,Beacon International,863949,020,00072,201806585,,,,Huff,Jennifer,L,04/04/1984,female,United States,10.8,
05/01/2018,Beacon America,863949,020,00072,201868511,,,,joshi,rama,,06/01/1943,female,United States,655.2,
04/28/2018,Beacon America,863949,020,00072,201873286,,,,Lopez,Aaron,S,11/10/1980,male,United States,8.2,
04/29/2018,OverseasCare Visitors Insurance Plan,863949,020,00072,201806678,,,,Katti,Nirmala,,06/05/1935,female,United States,519.75,
04/28/2018,Beacon International,863949,020,00072,201874976,,,,Murakami,Hironobu,,10/14/1984,male,United States,10.53,
04/28/2018,Beacon International,863949,020,00072,201876966,,,,Zaton,Katarzyna,,08/05/1985,female,United States,10.53,
05/02/2018,Beacon America,863949,020,00072,201845600,,,,VARANASY,SAVITHRI ,,12/18/1943,female,United States,25.2,
04/26/2018,Essential America,863949,020,00072,201897857,Passport(505703749),,,Digges,Jesse,Ryan,08/13/1983,male,Kenya,758,
04/26/2018,Essential America,863949,020,00072,201830034,,Passport(521306515),Spouse,Digges,Rachelle,Marie,03/11/1984,female,Kenya,1250,
04/26/2018,Essential America,863949,020,00072,201843789,,Passport(546339947),Dependant,Digges,Hadassah,Marie,08/29/2006,female,Kenya,442,
04/26/2018,Essential America,863949,020,00072,201821869,,Passport(530427825),Dependant,Digges,Bethany,Rose,08/07/2009,female,Kenya,0,
04/26/2018,Essential America,863949,020,00072,201838521,,Passport(488360997),Dependant,Digges,Jadon,David Livingstone,08/25/2013,male,Kenya,0,
04/27/2018,Essential America,863949,020,00072,201822427,Passport(513-66-0955),,,Jones,Daniel,,11/23/1962,male,United States,1855,
04/27/2018,Essential America,863949,020,00072,201816338,,Passport(515-82-4485),Spouse,Magalene,Clara ,,04/16/1962,female,United States,2527,
04/27/2018,Essential America,863949,020,00072,201846781,,Passport(217-63-2283),Dependant,Jones,Kristina,,09/17/2001,female,United States,442,
04/24/2018,Essential America,863949,020,00072,201841025,Passport(NA),,,NICHOLS,SOPHIA,,09/26/1958,female,United States,2527,
04/29/2018,Beacon International,863949,020,00072,201825790,Passport(801080272),,,Valera Rojas,John Adalberto,,12/27/1968,male,Colombia,67.8,
05/02/2018,Beacon America,863949,020,00072,201882546,Passport(K0345052),,,Kannappa,Ethirajan,,04/10/1939,male,United States,432,
05/01/2018,Beacon America,863949,020,00072,201874507,,,,Kapurova,Maryna,,11/11/1986,female,Ukraine,245.18,
04/28/2018,Beacon International,863949,020,00072,201878564,Passport(501701842),,,Esposito,Susanna ,,02/28/1993,female,United States,377.2,
04/27/2018,Beacon America,863949,020,00072,201858483,,,,Ni&ntilde;oles Aznar,Pablo,,02/23/1991,male,Spain,6.2,
04/27/2018,Beacon International,863949,020,00072,201879947,,,,Kelly,Liam,,11/12/1979,male,,13.5,
04/26/2018,Beacon International,863949,020,00072,201814422,,,,Weiszberger,Israel,,09/03/1999,male,United States,332.5,
04/29/2018,Beacon International,863949,020,00072,201877895,Passport(726749750),,,Vostrikova,Elena,,05/01/1985,female,Russia,19.31,
04/26/2018,Beacon International,863949,020,00072,201839411,,,,Van Bers,Carina,H,04/28/1958,female,United States,52,
04/26/2018,Beacon International,863949,020,00072,201879870,,,,Tibbs,Gareth,R,03/26/1958,male,United States,65,
04/29/2018,Beacon International,863949,020,00072,201842219,Passport(71 4021756),,,Kobzarev,Nikolai,,02/05/1989,male,Russia,19.67,
04/26/2018,Essential America,863949,020,00072,201834655,Passport(485896612),,,Vong,Sara,,03/01/1981,male,United States,584.4,
04/26/2018,Essential America,863949,020,00072,201815857,,Passport(502040484),Spouse,Vong,Neaty,,11/02/1982,female,United States,784,
04/26/2018,Essential America,863949,020,00072,201834611,,Passport(520536158),Dependant,Vong,Titus,Paul,03/27/2005,male,United States,342,
04/26/2018,Essential America,863949,020,00072,201889010,,Passport(520536153),Dependant,Vong,Tyler,Jared,11/18/2006,male,United States,342,
04/26/2018,Essential America,863949,020,00072,201839108,,Passport(520536156),Dependant,Vong,Lydia,Sara,11/13/2008,female,United States,0,
04/26/2018,Essential America,863949,020,00072,201852607,,Passport(520536157),Dependant,Vong,Thaddeus,Jude,07/05/2011,male,United States,0,
04/26/2018,Essential America,863949,020,00072,201869214,,Passport(520536154),Dependant,Vong,Timothy,Prachna,08/13/2013,male,United States,286,
04/26/2018,Essential America,863949,020,00072,201847253,,Passport(546111281),Dependant,Vong,Lois,Serenity,04/22/2016,female,United States,286,
04/26/2018,Essential America,863949,020,00072,201810699,,Passport(561322740),Dependant,Vong,Lara,Saralynn,10/17/2017,female,United States,286,
05/03/2018,Beacon America,863949,020,00072,201859969,,,,hantstater,yaakov,,03/11/2008,male,United States,12.5,
05/03/2018,Beacon America,863949,020,00072,201886423,,,,hanstater,Joseph,,09/25/1978,male,United States,18.88,
04/27/2018,Beacon America,863949,020,00072,201880828,,,,Rajmangal,Martin,,07/12/1984,male,United States,14.35,
05/02/2018,Beacon International,863949,020,00072,201870979,Passport(AP052858),,,ORDONEZ,NICOLAS,,10/04/1991,male,Colombia,125.97,
04/27/2018,Beacon America,863949,020,00072,201875045,,,,David,Gornall,,08/05/1967,male,United States,40.08,
04/27/2018,Beacon America,863949,020,00072,201841477,,,,Thompson,Dedrick,,11/21/1991,male,United States,13.48,
04/27/2018,Beacon America,863949,020,00072,201875271,,,,Benjamin,Amais,,06/16/1987,male,United States,14.35,
04/28/2018,Beacon America,863949,020,00072,201867421,,,,Sandiford,Andy,,06/08/1984,male,United States,12.3,
05/02/2018,Beacon America,863949,020,00072,201885597,,,,Weber,Yuda,,12/17/2009,male,United States,12.5,
05/02/2018,Beacon America,863949,020,00072,201878772,,,,Weber,solomon,,10/10/1988,male,United States,14.88,
04/26/2018,Beacon International,863949,020,00072,201848293,,,,Vinch,Diane,J,05/24/1972,female,United States,15,
04/26/2018,Beacon International,863949,020,00072,201869773,,,,swerdlow,trevor,a,06/26/1951,male,United States,25.5,
04/27/2018,Beacon America,863949,020,00072,201834434,,,,Languedoc,Michael,,05/16/1977,male,United States,21.44,
04/27/2018,Beacon America,863949,020,00072,201823714,,,,Scotland,Sharlaila,,03/28/1986,female,United States,14.35,
04/27/2018,Beacon America,863949,020,00072,201816488,,,,Leslie,Cleon,,11/21/1981,male,United States,14.35,
04/27/2018,Beacon America,863949,020,00072,201860460,,,,Seaman,Dwayne,,08/30/1981,male,United States,14.35,
04/27/2018,Beacon America,863949,020,00072,201844014,,,,Laurent ,Oral,,05/12/1970,male,United States,21.44,
04/28/2018,Beacon America,863949,020,00072,201899657,,,,Rogers,Vallen,,07/11/1992,male,United States,11.55,
04/28/2018,Beacon America,863949,020,00072,201836882,,,,Rawlins,Kristin ,,05/18/1981,male,United States,12.3,
04/28/2018,Beacon America,863949,020,00072,201801992,,,,Lake,Kayane,,06/09/1983,male,United States,12.3,
04/28/2018,Beacon America,863949,020,00072,201840251,,,,Isaac,Spencer ,,08/26/1986,male,United States,12.3,
04/28/2018,Beacon America,863949,020,00072,201893248,,,,Dowell,Desmond ,,01/02/1968,male,United States,27,
04/28/2018,Beacon America,863949,020,00072,201862332,,,,Samuel,Winston ,,12/12/1989,male,United States,11.55,
04/28/2018,Beacon America,863949,020,00072,201842566,,,,Charles,Phernel,,04/29/1974,male,United States,18.38,
04/28/2018,Beacon America,863949,020,00072,201825496,,,,Pilgrim,Glaston ,,12/26/1963,male,United States,27,
04/28/2018,Beacon America,863949,020,00072,201807042,,,,Ashton,Iria ,,05/15/1984,male,United States,12.3,
04/28/2018,Beacon America,863949,020,00072,201889308,,,,Samuel,Winston,,12/12/1989,male,United States,15.4,
04/26/2018,Beacon America,863949,020,00072,201896084,Passport(B4628030),,,Duong,Ngoc Luu,,08/19/1949,female,United States,403,
04/28/2018,Beacon America,863949,020,00072,201882450,,,,Matthias,Edson,,01/21/1974,male,United States,18.38,
04/28/2018,Beacon America,863949,020,00072,201864295,,,,Lessey,Curlan,,03/13/1984,male,United States,12.3,
04/28/2018,Beacon America,863949,020,00072,201854607,,,,Andrews,Niva,,11/04/1973,female,United States,18.38,
04/28/2018,Beacon America,863949,020,00072,201816648,,,,Young,Elizah,,03/20/1986,male,United States,12.3,
04/28/2018,Beacon America,863949,020,00072,201829177,,,,Thomas,Roland ,,07/31/1960,male,United States,27,
04/28/2018,Beacon America,863949,020,00072,201859878,,,,Williams,Dexter,,10/11/1964,male,United States,27,
04/28/2018,Beacon America,863949,020,00072,201878515,,,,John,Claurent ,,06/03/1989,male,United States,11.55,
04/28/2018,Beacon America,863949,020,00072,201816441,,,,Donal,Josaphat ,,11/04/1967,male,United States,27,
04/28/2018,Beacon America,863949,020,00072,201825121,,,,Auguste,Bradley,,04/07/1987,male,United States,12.3,
04/28/2018,Beacon America,863949,020,00072,201812336,,,,Charles,Stanius ,,04/01/1984,male,United States,12.3,
04/28/2018,Beacon America,863949,020,00072,201823833,,,,Sandiford,Andy,,06/08/1984,male,United States,12.3,
04/28/2018,Beacon America,863949,020,00072,201889850,,,,Etienne,Auzy,,04/02/1970,male,United States,18.38,
04/28/2018,Beacon America,863949,020,00072,201817359,,,,Otto,Sean ,,08/18/1990,male,United States,11.55,
04/28/2018,Beacon America,863949,020,00072,201848594,,,,Common,Alvin ,,07/13/1981,male,United States,12.3,
04/28/2018,Beacon America,863949,020,00072,201850829,,,,Adams,Royston,,07/14/1973,male,United States,18.38,
04/28/2018,Beacon America,863949,020,00072,201889399,,,,DeSilva,Kevin,,09/02/1974,male,United States,18.38,
04/25/2018,Beacon International,863949,020,00072,201884584,,,,Friedman,David,,08/18/1978,male,United States,6.75,
04/25/2018,Beacon International,863949,020,00072,201868556,,,,Friedman,Jonas,,03/26/1973,male,United States,11.25,
04/25/2018,Beacon International,863949,020,00072,201848341,,,,Keane,John,F,06/21/1966,male,United States,135.3,
04/28/2018,Beacon America,863949,020,00072,201810969,,,,Morris,Derick,,01/10/1966,male,United States,27,
04/28/2018,Beacon America,863949,020,00072,201896254,,,,Walthrust,Pedro,,04/15/1970,male,United States,18.38,
04/28/2018,Beacon America,863949,020,00072,201818568,Passport(AN512823),,,GALLO CAMPOS,NICOLAS,F,02/24/1985,male,Colombia,32.25,
04/28/2018,Beacon America,863949,020,00072,201841226,,,,Pinder,Lecia,,08/06/1983,female,United States,12.3,
04/28/2018,Beacon America,863949,020,00072,201894177,,,,Small,Leland,,09/17/1961,male,United States,27,
04/28/2018,Beacon America,863949,020,00072,201804217,,,,Alleyne,Ron,,05/14/1975,male,United States,18.38,
04/29/2018,Beacon International,863949,020,00072,201858143,,,,Suero,Maritza ,,07/19/1964,female,United States,39,
04/29/2018,Beacon International,863949,020,00072,201837752,,,,Rodriguez,Juan,,12/01/1959,male,United States,39,
04/29/2018,Beacon International,863949,020,00072,201894938,,,,Pimentel,Amauri,,11/27/1959,male,United States,39,
04/25/2018,Beacon International,863949,020,00072,201840574,,,,Vasquez,Nicki,,10/24/1962,female,United States,15.7,
04/30/2018,Beacon America,863949,020,00072,201851530,Passport(H2900380),,,Narayanan,Kamala,,05/25/1948,female,United States,423.05,
04/27/2018,OverseasCare Visitors Insurance Plan,863949,020,00072,201871493,Passport(L4773645),,,PARDIWALLA ,NALINIBEN ,K,03/30/1948,female,United States,384.8,
04/27/2018,OverseasCare Visitors Insurance Plan,863949,020,00072,201874081,Passport(L4773645),,,PARDIWALLA,KRISHNAKUMAR,R,02/13/1946,male,United States,384.8,
04/30/2018,Beacon International,863949,020,00072,201821247,,,,Davidson,Ian,J,06/29/2011,male,United States,440.44,
04/30/2018,Beacon International,863949,020,00072,201820302,,,,Davidson,Natalie,E,02/06/2009,female,United States,440.44,
04/30/2018,Beacon International,863949,020,00072,201843119,,,,Davidson,Gavin ,I,03/06/2007,male,United States,440.44,
04/30/2018,Beacon International,863949,020,00072,201869937,,,,Davidson,Caelan,E,03/25/2002,male,United States,440.44,
04/30/2018,Beacon International,863949,020,00072,201853372,Passport(545596877),,,Davidson,Joshua,R,10/31/1979,male,United States,552.55,
04/27/2018,Beacon International,863949,020,00072,201849245,,,,Patane,Joseph,R,05/22/1970,male,United States,97.5,
04/29/2018,Beacon America,863949,020,00072,201855145,,,,Malkiel,Alex,,02/18/1987,male,United States,125.05,
05/01/2018,Beacon America,863949,020,00072,201867941,Passport(HL573184),,,Warner,Kristen,,04/14/1973,female,United States,92.38,
04/24/2018,Beacon America,863949,020,00072,201869849,,,,Mugisha,Grace,B,09/17/1997,female,Burundi,49.1,
04/24/2018,Beacon America,863949,020,00072,201804130,,,,Ndikumana,Evariste,,04/07/1979,male,Burundi,64.94,
05/03/2018,Beacon International,863949,020,00072,201870489,,,,Winner,Andrew,,06/12/1962,male,United States,30.2,
04/28/2018,Beacon International,863949,020,00072,201805220,,,,Prakash,Payal,,11/29/1989,female,United States,6.84,
04/28/2018,Beacon International,863949,020,00072,201811972,,,,Venkatesh,Adarsh,A,09/15/1986,male,United States,8.1,
05/01/2018,Beacon International,863949,020,00072,201838635,Passport(511584797),,,JOHNSON,LORAINE,A,11/22/1949,female,United States,335.23,
05/01/2018,Beacon International,863949,020,00072,201844113,Passport(530897837),,,JOHNSON,STEVEN,P,05/03/1946,male,United States,496.8,
04/24/2018,Beacon America,863949,020,00072,201842785,Passport(AQ341945),,,Orostegui,Victor,,05/25/1991,male,Colombia,87.2,
04/24/2018,OverseasCare Visitors Insurance Plan,863949,020,00072,201849242,,,,Wati,Chandra,,06/17/1943,female,United States,332.28,
05/01/2018,Beacon America,863949,020,00072,201853500,,,,SALOM,MARIA FABIANA,,02/27/2013,female,Venezuela,77.17,
05/01/2018,Beacon America,863949,020,00072,201884424,Passport(145083247),,,SALOM,JESUS EDUARDO,,02/27/2013,male,Venezuela,77.17,
04/23/2018,Beacon International,863949,020,00072,201826086,,,,Harvey,Kyle,M,03/25/1995,male,Canada,25.08,
04/23/2018,Beacon International,863949,020,00072,201849463,,,,Friedman,Chana,,09/18/1998,female,United States,46.93,
04/25/2018,Beacon America,863949,020,00072,201838917,Passport(AO430463),,,Diaz,Harold,,08/17/1975,male,Colombia,80,
04/30/2018,Beacon International,863949,020,00072,201821517,Passport(452834470),,,Drinkard,Timothy,A,03/13/1981,male,United States,45.54,
05/01/2018,Enhanced America,863949,020,00072,201868883,Passport(458991535),,,White,Brian,Michael,07/02/1966,male,United States,1924,
05/01/2018,Enhanced America,863949,020,00072,201805627,,Passport(458991533),Spouse,White,Catherine,Rene,11/01/1973,female,United States,3227,
05/01/2018,Enhanced America,863949,020,00072,201823497,,Passport(506091385),Dependant,White,Shelby,Lynn,09/05/2006,female,United States,927,
05/01/2018,Enhanced America,863949,020,00072,201895201,,Passport(506091386),Dependant,White,Waylen,Michael,11/06/2007,male,United States,927,
04/24/2018,Beacon America,863949,020,00072,201843417,Passport(ZN484781),,,KOPULANDE,JANET,K K,08/08/1951,female,United States,59.5,
04/22/2018,Beacon America,863949,020,00072,201842441,Passport(3328322),,,VELASQUEZ CESIN,ALBERTO,,11/14/1947,male,Venezuela,86.4,
04/22/2018,Beacon International,863949,020,00072,201897203,,,,Schulman,Edwina,,03/07/1960,female,United States,36.4,
04/26/2018,Beacon America,863949,020,00072,201808192,,,,Darmani,Homa,(,06/30/1961,female,Jordan,315,
04/21/2018,Beacon America,863949,020,00072,201818971,Passport(K5059634),,,Tirumalai,Rangarajan,,06/10/1940,male,United States,324.72,
04/21/2018,Beacon International,863949,020,00072,201850291,,,,Mosley,Carins,,04/22/1973,female,United States,9,
04/21/2018,Beacon International,863949,020,00072,201805602,,,,Mosley,Darren,,10/11/1973,male,United States,9,
05/02/2018,Beacon International,863949,020,00072,201857427,Passport(45208788273),,,Bernier,Lawrence,R.,07/07/1964,male,United States,95.48,
04/21/2018,Beacon International,863949,020,00072,201867425,,,,Yang,Marilyn,J,11/09/1990,female,United States,6.84,
04/21/2018,Beacon International,863949,020,00072,201898520,,,,Levrints,Adriana,,07/19/1991,female,United States,15.96,
04/21/2018,Beacon International,863949,020,00072,201860864,,,,Clark,Lacey,L,10/17/1970,female,United States,18,
04/21/2018,Beacon International,863949,020,00072,201891741,Passport(458354171),,,Eggert,Hartmut,,11/08/1965,male,United States,211.95,
05/02/2018,Beacon International,863949,020,00072,201877383,Passport(AD345581),,,Reid,Jillian,P,05/02/1996,female,Canada,34.38,
04/23/2018,Beacon International,863949,020,00072,201838225,,,,Tesch,Eric,,11/16/1961,male,United States,44.35,
04/20/2018,Beacon International,863949,020,00072,201804073,,,,Francis,Paul,j,09/11/1978,male,United States,19.13,
04/21/2018,Beacon International,863949,020,00072,201854485,Passport(555687874),,,Hernandez,Luis ,H,02/21/1948,male,United States,56.93,
04/21/2018,Beacon International,863949,020,00072,201864191,Passport(521440729),,,Hernandez,Dilia,Janeth,09/18/1953,female,United States,47.03,
04/20/2018,Beacon America,863949,020,00072,201847318,,,,tubman,susan,l,10/08/1958,female,Grenada,158.76,
04/20/2018,Beacon America,863949,020,00072,201818837,,,,anderson,jeff,h,01/16/1956,male,Grenada,198.45,
04/21/2018,Beacon International,863949,020,00072,201801776,Passport(485572625),,,Brenes,Juan,,02/27/1966,male,United States,31.09,
04/21/2018,Beacon International,863949,020,00072,201871813,Passport(461095409),,,Demicco,Gloria,,03/24/1951,female,United States,50.49,
04/21/2018,Beacon International,863949,020,00072,201808975,,,,Prasad,Vaishali,,02/06/1984,female,United States,166.5,
04/21/2018,Beacon International,863949,020,00072,201826873,,,,Cozza,Chrsitian,,12/31/1981,male,United States,166.5,
04/20/2018,Beacon International,863949,020,00072,201816935,,,,Decker,Lori,,06/30/1953,female,United States,28.8,
04/20/2018,Beacon International,863949,020,00072,201859107,,,,Decker,Willard Gean,,06/24/1951,male,United States,34,
04/20/2018,Beacon America,863949,020,00072,201826445,,,,Okunev,Zakhar,V,04/30/1995,male,Canada,32.73,
04/19/2018,Beacon America,863949,020,00072,201823711,,,,Hazzard,Jade,A,03/03/1999,female,United States,7.7,